Benzene, 3-cyclohexen-1-yl-

Gas phase ion energetics data

Data compiled by: Sharon G. Lias, Rhoda D. Levin, and Sherif A. Kafafi

Ionization energy determinations

IE (eV) Method Reference
8.57 ± 0.01PERang, Paldoia, et al., 1974

Normal alkane RI, non-polar column, temperature ramp

View large format table.

Column type Active phase I Reference Comment
CapillaryDB-51345.Landy, Nicklaus, et al., 200430. m/0.32 mm/1. μm, H2, 5. K/min, 240. C @ 10. min; Tstart: 40. C

Normal alkane RI, polar column, custom temperature program

View large format table.

Column type Active phase I Reference Comment
CapillaryDB-Wax Etr1800.Landy, Nicklaus, et al., 200430. m/0.32 mm/1. μm, H2; Program: 35C => 10C/min => 110C => 5C/min => 180C => 10C/min => 220C(15min)
CapillaryDB-Wax Etr1802.Landy, Nicklaus, et al., 200430. m/0.32 mm/1. μm, H2; Program: 35C => 10C/min => 110C => 5C/min => 180C => 10C/min => 220C(15min)
CapillaryDB-Wax Etr1800.Landy, Nicklaus, et al., 200430. m/0.32 mm/1. μm, H2; Program: 35C => 10C/min => 110C => 5C/min => 180C => 10C/min => 220C(15min)

References

Rang, Paldoia, et al., 1974
Rang, S.; Paldoia, P.; Talvari, A., Ionization potentials of unsaturated hydrocarbons. 2. Mono-substituted cyclopentenes and cyclohexenes, Eesti. NSV Tead. Akad. Toim., 1974, 354. [all data]

Egorov, Kaplan, et al., 1958
Egorov, Iu.P.; Kaplan, E.P.; Letina, Z.I.; Shliapochnikov, V.A.; Petrov, A.D., On the order of addition of lithium to biphenyl, Zh. Obshch. Khim., 1958, 28, 3284-3287. [all data]

Landy, Nicklaus, et al., 2004
Landy, P.; Nicklaus, S.; Sémon, E.; Mielle, P.; Guichard, E., Representativeness of extracts of offset paper packaging and analysis of the main odor-active compounds, J. Agric. Food Chem., 2004, 52, 8, 2326-2334, https://doi.org/10.1021/jf0352677 . [all data]