1H,5H-Pyrazolo[1,2-a][1,2]diazepine,hexahydro-

Gas phase ion energetics data

Data compiled as indicated in comments:
LBLHLM - Sharon G. Lias, John E. Bartmess, Joel F. Liebman, John L. Holmes, Rhoda D. Levin, and W. Gary Mallard
LLK - Sharon G. Lias, Rhoda D. Levin, and Sherif A. Kafafi

Ionization energy determinations

IE (eV) Method Reference Comment
7.58PENelsen, Peacock, et al., 1976LLK
7.58PENelsen and Buschek, 1974LLK
8.46PENelsen, 1984Vertical value; LBLHLM

References

Nelsen, Peacock, et al., 1976
Nelsen, S.F.; Peacock, V.; Weisman, G.R., Single-electron oxidation equilibria of tetraalkylhydrazines. Comparison of solution E° values and vapor-phase ionization potentials, J. Am. Chem. Soc., 1976, 98, 5269. [all data]

Nelsen and Buschek, 1974
Nelsen, S.F.; Buschek, J.M., Photoelectron spectra of hydrazines. V. Pyrazolidine and hexahydropyridazine derivatives, J. Am. Chem. Soc., 1974, 96, 6987. [all data]

Nelsen, 1984
Nelsen, S.F., Ionization from nitrogen and oxygen lone pairs: A comparison of trialkylamine, dialkyl ether, tetraalkylhydrazine, and dialkyl peroxide photoelectron spectroscopic ionization potentials, J. Org. Chem., 1984, 49, 1891. [all data]