Apocynin

Normal alkane RI, polar column, custom temperature program

Data compiled by: NIST Mass Spectrometry Data Center, William E. Wallace, director

Column type CapillaryCapillaryCapillaryCapillaryCapillary
Active phase StabilwaxDB-WaxDB-Wax EtrDB-WaxCP-Wax 52 CB
Column length (m) 30.60.60.30.30.
Carrier gas HeliumHeliumHeHeH2
Substrate
Column diameter (mm) 0.250.250.250.250.32
Phase thickness (μm) 0.250.500.50.25
Program 35 0C 3 0C/min -> 100 0C 5 0C/min -> 240 0C (10 min)40 0C (3 min) 10 0C/min -> 90 0C 2 0C/min -> 230 0C (37 min)40C(3min) => 10C/min => 90C => 2C/min => 230C (37min)50 0C (2 min) 6 0C/min -> 150 0C 8 0C/min -> 230 0C (15 min)60 0C 2 0C/min -> 220 0C 3 0C/min -> 245 0C
I 2667.2664.2664.2623.2637.
ReferenceChinnici, Guerrero, et al., 2009Loscos, Hernandez-Orte, et al., 2009Loskos, Hernandez-Orte, et al., 2007Tian, Zhang, et al., 2007Carro Marino, López Tamames, et al., 1995
Comment MSDC-RI MSDC-RI MSDC-RI MSDC-RI MSDC-RI
Column type CapillaryCapillary
Active phase SupelcowaxSupelcowax-10
Column length (m) 30.30.
Carrier gas
Substrate
Column diameter (mm) 0.250.53
Phase thickness (μm)  0.25
Program not specified80C(5min) => 5C/min => 155C => 4C/min => 240C(30min)
I 2626.2640.
ReferenceGarneau, Bouhajib, et al., 1994Miranda-Lopez, Libbey, et al., 1992
Comment MSDC-RI MSDC-RI

Normal alkane RI, non-polar column, temperature ramp

Data compiled by: NIST Mass Spectrometry Data Center, William E. Wallace, director

Column type CapillaryCapillaryCapillaryCapillary
Active phase HP-5 MSZB-5HP-5 MSDB-5
Column length (m) 30.30.30.30.
Carrier gas  HeliumHeliumHe
Substrate
Column diameter (mm) 0.250.250.250.25
Phase thickness (μm) 0.250.250.250.25
Tstart (C) 60.40.60.40.
Tend (C) 300.280.300.250.
Heat rate (K/min) 15.6.15.2.
Initial hold (min) 2.1.2.
Final hold (min) 10.9.10.
I 1539.1498.1539.1484.
ReferenceXu, Han, et al., 2012Harrison and Priest, 2009Xu, Han, et al., 2009Güntert, Rapp, et al., 1986
Comment MSDC-RI MSDC-RI MSDC-RI MSDC-RI

References

Chinnici, Guerrero, et al., 2009
Chinnici, F.; Guerrero, E.D.; Sonni, F.; Natali, N.; Marin, R.N.; Riponi, C., Gas chromatography - mass spectrometry (GC-MS) characterization of volatile compounds in quality vinegars with protected Europian geographical indication, J. Agric. Food Chem., 2009, 57, 11, 4784-4792, https://doi.org/10.1021/jf804005w . [all data]

Loscos, Hernandez-Orte, et al., 2009
Loscos, N.; Hernandez-Orte, P.; Cacho, J.; Ferreira, V., Fate of grape flavor precursors during storage on yeast lees, J. Agric. Food Chem., 2009, 57, 12, 5468-5479, https://doi.org/10.1021/jf804057q . [all data]

Loskos, Hernandez-Orte, et al., 2007
Loskos, N.; Hernandez-Orte, P.; Cacho, J.; Ferreira, V., Release and formation of varietal aroma compounds during alcoholic fermentation from nonfloral grape odorless flavor precursors fractions, J. Agric. Food Chem., 2007, 55, 16, 6674-6684, https://doi.org/10.1021/jf0702343 . [all data]

Tian, Zhang, et al., 2007
Tian, Y.; Zhang, X.; Huang, T.; Zou, K.; Zhou, J., Research advances on the essential oils from leaves of Eucalyptus, Food Fermentation Ind. (Chinese), 2007, 33, 10, 143-147. [all data]

Carro Marino, López Tamames, et al., 1995
Carro Marino, N.; López Tamames, E.; García Jares, C.M., Contribution to the study of the aromatic potential of three muscat Vitis vinifera varieties: identification of new compounds, Food Sci. Technol. Int., 1995, 1, 2-3, 105-116, https://doi.org/10.1177/108201329500100206 . [all data]

Garneau, Bouhajib, et al., 1994
Garneau, F.X.; Bouhajib, M.; Collin, G.J.; Gagnon, M.; ApSimon, J.W., The glycosidically bound volatile compounds of Picea mariana (Mill.) B.S.P., J. Essent. Oil Res., 1994, 6, 1, 43-46, https://doi.org/10.1080/10412905.1994.9698323 . [all data]

Miranda-Lopez, Libbey, et al., 1992
Miranda-Lopez, R.; Libbey, L.M.; Watson, B.T.; McDaniel, M.R., Odor analysis of Pinot noir wines from grapes of different maturities by a gas chromatography-olfactometry technique (Osme), J. Food Sci., 1992, 57, 4, 985-993, https://doi.org/10.1111/j.1365-2621.1992.tb14339.x . [all data]