Furazan, dimethyl-

Gas phase thermochemistry data

Data compiled by: Hussein Y. Afeefy, Joel F. Liebman, and Stephen E. Stein

Quantity Value Units Method Reference Comment
Δfgas107. ± 4.6kJ/molCcbMatyushin, Pepekin, et al., 1971

Condensed phase thermochemistry data

Data compiled by: Hussein Y. Afeefy, Joel F. Liebman, and Stephen E. Stein

Quantity Value Units Method Reference Comment
Δfliquid56. ± 4.kJ/molCcbMatyushin, Pepekin, et al., 1971
Quantity Value Units Method Reference Comment
Δcliquid-2488. ± 4.kJ/molCcbMatyushin, Pepekin, et al., 1971

References

Matyushin, Pepekin, et al., 1971
Matyushin, Yu.N.; Pepekin, V.I.; Golova, S.P.; Godovikova, T.I.; Khmelnitskii, L.I., Enthalpy of formation of dimethylfuroxan and dimethylfurazan, Bull. Acad. Sci. USSR, Div. Chem. Sci., 1971, 162-164. [all data]