Benzamide, N-(1,1-dimethylethyl)-N-methyl-

Kovats' RI, polar column, isothermal

Data compiled by: NIST Mass Spectrometry Data Center, William E. Wallace, director

Column type CapillaryCapillaryCapillary
Active phase DB-WaxDB-WaxDB-Wax
Column length (m) 30.30.30.
Carrier gas N2N2N2
Substrate
Column diameter (mm) 0.2340.2340.234
Phase thickness (μm) 0.250.250.25
Temperature (C) 170.190.210.
I 2365.652377.692389.32
ReferenceAntonovic, Mijin, et al., 2000Antonovic, Mijin, et al., 2000Antonovic, Mijin, et al., 2000
Comment MSDC-RI MSDC-RI MSDC-RI

References

Antonovic, Mijin, et al., 2000
Antonovic, D.G.; Mijin, D.Z.; Petrovic, S.D.; Stojanovic, N.D.; Nikolic, A.D., Gas chromatographic retention indices for the N-methyl-N-substituted benzamides on capillary columns, Indian J. Chem., 2000, 39B, 694-699. [all data]