Limonene oxide, trans-

Kovats' RI, non-polar column, temperature ramp

View large format table.

Column type Active phase I Reference Comment
CapillaryHP-5MS1125.Gkinis, Tzakou, et al., 200330. m/0.25 mm/0.25 μm, He, 3. K/min; Tstart: 60. C; Tend: 280. C
CapillarySE-301146.Palá-Paúl, Velasco-Negueruela, et al., 200225. m/0.22 mm/0.25 μm, He, 4. K/min; Tstart: 70. C; Tend: 220. C
CapillarySE-541139.Adams, 200030. m/0.26 mm/0.25 μm, 3. K/min; Tstart: 60. C; Tend: 246. C
CapillaryHP-51137.Sajjadi and Ghassemi, 199930. m/0.25 mm/0.25 μm, He, 4. K/min; Tstart: 60. C; Tend: 280. C
CapillarySE-301106.Jantan, Ahmad, et al., 1996N2, 60. C @ 10. min, 3. K/min, 180. C @ 1. min; Column length: 25. m; Column diameter: 0.2 mm
CapillaryOV-1011129.Padrayuttawat, Tamura, et al., 199650. m/0.25 mm/0.2 μm, N2, 2. K/min, 200. C @ 60. min; Tstart: 80. C

Kovats' RI, non-polar column, custom temperature program

View large format table.

Column type Active phase I Reference Comment
CapillaryOV-11109.El-Shazly, Dorai, et al., 200230. m/0.25 mm/0.25 μm, He; Program: 44C(4min) => 3C/min => 74C => 6C/min => 134C => 12C/min => 312C

Kovats' RI, polar column, temperature ramp

View large format table.

Column type Active phase I Reference Comment
CapillaryDB-Wax1459.Umano and Shibamoto, 198840. C @ 10. min, 2. K/min; Column length: 60. m; Column diameter: 0.25 mm; Tend: 220. C
CapillaryDB-Wax1462.Umano and Shibamoto, 198840. C @ 10. min, 2. K/min; Column length: 60. m; Column diameter: 0.25 mm; Tend: 220. C

Van Den Dool and Kratz RI, non-polar column, temperature ramp

View large format table.

Column type Active phase I Reference Comment
CapillaryHP-5MS1141.Benkaci-Ali, Baaliouamer, et al., 200730. m/0.25 mm/0.25 μm, He, 60. C @ 8. min, 2. K/min, 250. C @ 30. min
CapillaryMDN-51134.Dugo, Mondello, et al., 200530. m/0.25 mm/0.25 μm, He, 3. K/min; Tstart: 50. C; Tend: 250. C
CapillaryDB-11121.Fanciullino, Gancel, et al., 200530. m/0.25 mm/0.25 μm, He, 3. K/min, 250. C @ 20. min; Tstart: 40. C
CapillaryDB-11121.Gancel, Ollitrault, et al., 200530. m/0.25 mm/0.25 μm, He, 3. K/min, 250. C @ 20. min; Tstart: 40. C
CapillaryHP-5MS1125.Smadja, Rondeau, et al., 200560. m/0.2 mm/0.25 μm, He, 2. K/min, 200. C @ 10. min; Tstart: 60. C
CapillaryMega 5MS1127.Verzera, Trozzi, et al., 200530. m/0.25 mm/0.25 μm, He, 40. C @ 2. min, 3. K/min; Tend: 240. C
CapillarySPB-11127.Chisholm, Wilson, et al., 200325. m/0.25 mm/0.25 μm, 35. C @ 10. min, 4. K/min; Tend: 225. C
CapillaryDB-51139.Choi, 200330. m/0.25 mm/0.25 μm, N2, 70. C @ 2. min, 2. K/min, 230. C @ 20. min
CapillaryDB-11121.Gancel, Ollitrault, et al., 200330. m/0.25 mm/0.25 μm, He, 3. K/min, 250. C @ 20. min; Tstart: 40. C
CapillaryDB-51147.Högnadóttir and Rouseff, 200330. m/0.32 mm/0.5 μm, 7. K/min, 265. C @ 5. min; Tstart: 40. C
CapillaryDB-51140.Jantan, Ling, et al., 200330. m/0.25 mm/0.25 μm, He, 75. C @ 10. min, 3. K/min, 230. C @ 20. min
CapillaryHP-5MS1138.Mimica-Dukic, Kujundzic, et al., 200330. m/0.25 mm/0.25 μm, He, 3. K/min; Tstart: 60. C; Tend: 280. C
CapillaryMega 5MS1127.Verzera, Trozzi, et al., 200330. m/0.25 mm/0.25 μm, He, 40. C @ 2. min, 3. K/min; Tend: 240. C
CapillaryDB-51139.Choi, Kim. M.-S.L., et al., 200230. m/0.25 mm/0.25 μm, He, 70. C @ 2. min, 4. K/min, 230. C @ 20. min
CapillaryBP-11120.Lota, de Rocca Serra, et al., 200250. m/0.22 mm/0.25 μm, He, 2. K/min, 220. C @ 20. min; Tstart: 60. C
CapillarySPB-11120.Chisholm, Wilson, et al., 200115. m/0.25 mm/0.25 μm, 35. C @ 3. min, 6. K/min, 225. C @ 10. min
CapillaryHP-51134.Kim, Thuy, et al., 200030. m/0.25 mm/0.25 μm, He, 40. C @ 5. min, 2. K/min, 200. C @ 20. min
CapillaryBP-11120.Lota, de Rocca Serra, et al., 200050. m/0.22 mm/0.25 μm, He, 2. K/min, 230. C @ 35. min; Tstart: 60. C
CapillaryHP-51143.Song, Sawamura, et al., 200030. m/0.25 mm/0.25 μm, He, 2. K/min; Tstart: 70. C; Tend: 230. C
CapillaryDB-51143.Song, Sawamura, et al., 2000, 230. m/0.25 mm/0.25 μm, N2, 2. K/min; Tstart: 70. C; Tend: 230. C
CapillaryMega 5MS1127.Verzera, la Rosa, et al., 200030. m/0.25 mm/0.25 μm, He, 40. C @ 2. min, 3. K/min; Tend: 240. C
CapillaryMega 5MS1127.Verzera, Trozzi, et al., 200030. m/0.25 mm/0.25 μm, He, 40. C @ 2. min, 3. K/min; Tend: 240. C
CapillaryBP-11122.Lota, Serra, et al., 199950. m/0.22 mm/0.25 μm, He, 2. K/min, 230. C @ 35. min; Tstart: 60. C
CapillaryOV-1011125.Yang, Sugisawa, et al., 1992N2, 2. K/min; Column length: 50. m; Column diameter: 0.25 mm; Tstart: 80. C; Tend: 200. C
CapillaryOV-1011125.Yang, Sugisawa, et al., 1992N2, 2. K/min; Column length: 50. m; Column diameter: 0.25 mm; Tstart: 80. C; Tend: 200. C

Van Den Dool and Kratz RI, non-polar column, custom temperature program

View large format table.

Column type Active phase I Reference Comment
CapillaryHP-5MS1139.Andriamaharavo, 201430. m/0.25 mm/0.25 μm, He; Program: 60C (1 min) => 5 C/min => 210C => 10 C/min => 280C (15 min)
CapillaryBPX-51149.Cardeal, da Silva, et al., 200630. m/0.25 mm/0.25 μm; Program: 35C(5min) => 3C/min => 210C => 40C/min => 240C (4min)
CapillarySE-521138.Mondello, Dugo, et al., 199560. m/0.32 mm/0.40 μm, He; Program: 45 C (6 min) 3 C/min -> 111 0C 2 C/min -> 160 C 3 C/min -> 300 C (15 min)

Van Den Dool and Kratz RI, polar column, temperature ramp

View large format table.

Column type Active phase I Reference Comment
CapillaryDB-Wax1439.Fanciullino, Gancel, et al., 200530. m/0.25 mm/0.25 μm, He, 3. K/min, 250. C @ 20. min; Tstart: 40. C
CapillaryDB-Wax1439.Gancel, Ollitrault, et al., 200530. m/0.25 mm/0.25 μm, He, 3. K/min, 250. C @ 20. min; Tstart: 40. C
CapillarySupelcowax-101420.Smadja, Rondeau, et al., 200560. m/0.2 mm/0.2 μm, He, 2. K/min, 200. C @ 10. min; Tstart: 60. C
CapillaryMegawax1423.Verzera, Trozzi, et al., 200530. m/0.25 mm/0.25 μm, He, 40. C @ 6. min, 2. K/min, 220. C @ 10. min
CapillarySupelcowax1480.Chisholm, Wilson, et al., 200325. m/0.25 mm/0.25 μm, 35. C @ 5. min, 4. K/min, 225. C @ 10. min
CapillaryDB-Wax1439.Gancel, Ollitrault, et al., 200360. m/0.32 mm/0.25 μm, H2, 1.5 K/min, 245. C @ 20. min; Tstart: 40. C
CapillaryMegawax1423.Verzera, Trozzi, et al., 200330. m/0.25 mm/0.25 μm, He, 40. C @ 6. min, 2. K/min, 220. C @ 10. min
CapillaryDB-Wax1466.Choi, Kim. M.-S.L., et al., 200260. m/0.25 mm/0.25 μm, N2, 2. K/min, 230. C @ 20. min; Tstart: 70. C
CapillaryBP-201451.Lota, de Rocca Serra, et al., 200250. m/0.22 mm/0.25 μm, He, 2. K/min, 220. C @ 20. min; Tstart: 60. C
CapillaryDB-Wax1441.Kim, Thuy, et al., 200030. m/0.25 mm/0.25 μm, He, 40. C @ 5. min, 2. K/min, 200. C @ 20. min
CapillaryBP-201451.Lota, de Rocca Serra, et al., 200050. m/0.22 mm/0.25 μm, He, 2. K/min, 230. C @ 35. min; Tstart: 60. C
CapillaryMegawax1423.Verzera, Trozzi, et al., 200030. m/0.25 mm/0.25 μm, He, 40. C @ 6. min, 2. K/min, 220. C @ 10. min
CapillaryBP-201453.Lota, Serra, et al., 199950. m/0.22 mm/0.25 μm, He, 2. K/min, 230. C @ 35. min; Tstart: 60. C
CapillaryCarbowax 20M1451.Mondello, Dugo, et al., 199560. m/0.32 mm/0.425 μm, He, 45. C @ 3. min, 3. K/min, 300. C @ 20. min

Van Den Dool and Kratz RI, polar column, custom temperature program

View large format table.

Column type Active phase I Reference Comment
CapillarySupelcowax-101467.Chisholm, Wilson, et al., 2001Program: not specified

Normal alkane RI, non-polar column, temperature ramp

View large format table.

Column type Active phase I Reference Comment
CapillaryHP-5MS1151.Ferhat, Meklati, et al., 200730. m/0.25 mm/0.25 μm, He, 60. C @ 8. min, 2. K/min, 250. C @ 15. min
CapillaryCP Sil 5 CB1127.Hnawia, Cabalion, et al., 200730. m/0.25 mm/0.25 μm, N2, 5. K/min; Tstart: 50. C; Tend: 200. C
CapillaryDB-11112.Monser-Esfahani, Karamkhani, et al., 200730. m/0.25 mm/0.25 μm, Helium, 50. C @ 1. min, 2.5 K/min, 260. C @ 20. min
CapillaryDB-51138.Askari and Sefidkon, 200630. m/0.25 mm/0.25 μm, He, 40. C @ 5. min, 4. K/min; Tend: 260. C
CapillaryBP-11121.Boti, Muselli, et al., 200650. m/0.22 mm/0.25 μm, He, 2. K/min, 220. C @ 20. min; Tstart: 60. C
CapillaryDB-51139.Javidnia, Miri, et al., 200630. m/0.25 mm/0.25 μm, Helium, 3. K/min; Tstart: 60. C; Tend: 260. C
CapillaryDB-11121.Lan Phi N.T., Nishiyama C., et al., 200660. m/0.25 mm/0.25 μm, 70. C @ 2. min, 2. K/min, 230. C @ 20. min
CapillaryCP Sil 5 CB1125.Lis and Milczarek, 200630. m/0.32 mm/0.25 μm, N2, 4. K/min; Tstart: 50. C; Tend: 300. C
CapillaryDB-11122.Sawamura, Onishi, et al., 200660. m/0.25 mm/0.25 μm, 70. C @ 2. min, 2. K/min, 230. C @ 20. min
CapillaryDB-11125.Sefidkon, Jamzad, et al., 2006He, 4. K/min; Column length: 60. m; Column diameter: 0.25 mm; Tstart: 40. C; Tend: 250. C
CapillaryRSL-2001142.Jirovetz, Buchbauer, et al., 200530. m/0.25 mm/0.25 μm, 40. C @ 2. min, 6. K/min, 280. C @ 10. min
CapillaryDB-51138.Sefidkon and Jamzad, 2005He, 4. K/min; Column length: 30. m; Column diameter: 0.25 mm; Tstart: 40. C; Tend: 240. C
CapillaryDB-5MS1139.da Silva, Andrade, et al., 200530. m/0.25 mm/0.25 μm, He, 3. K/min; Tstart: 60. C; Tend: 240. C
CapillaryDB-11124.Sonboli, Salehi, et al., 200560. m/0.25 mm/0.25 μm, He, 5. K/min, 250. C @ 10. min; Tstart: 60. C
CapillaryDB-11126.Palá-Paúl, Velasco-Negueruela, et al., 200450. m/0.25 mm/0.25 μm, N2, 4. K/min; Tstart: 95. C; Tend: 240. C
CapillaryDB-11125.Sawamura, Son, et al., 200460. m/0.25 mm/0.25 μm, 70. C @ 2. min, 2. K/min, 230. C @ 20. min
CapillaryRSL-2001142.Jirovetz, Buchbauer, et al., 200330. m/0.25 mm/0.25 μm, H2, 40. C @ 2. min, 6. K/min, 280. C @ 10. min
CapillaryHP-51136.Mookdasanit, Tamura, et al., 2003Helium, 2. K/min, 210. C @ 60. min; Column length: 30. m; Column diameter: 0.32 mm; Tstart: 70. C
CapillaryDB-11133.Tu, Onishi, et al., 200360. m/0.25 mm/0.25 μm, N2, 70. C @ 2. min, 2. K/min, 230. C @ 20. min
CapillaryOV-1011125.Yang, 2001N2, 2. K/min; Column length: 50. m; Column diameter: 0.25 mm; Tstart: 80. C; Tend: 200. C
CapillaryOV-1011125.Yang, 2001, 2N2, 2. K/min; Column length: 50. m; Column diameter: 0.25 mm; Tstart: 80. C; Tend: 200. C
CapillaryDB-51137.Mitiku, Sawamura, et al., 200030. m/0.22 mm/0.25 μm, N2, 70. C @ 2. min, 4. K/min, 230. C @ 20. min
CapillaryOV-1011125.Tamura, Yang, et al., 19932. K/min; Column length: 50. m; Column diameter: 0.25 mm; Tstart: 80. C; Tend: 200. C
CapillaryOV-1011125.Tamura, Yang, et al., 19932. K/min; Column length: 50. m; Column diameter: 0.25 mm; Tstart: 80. C; Tend: 200. C

Normal alkane RI, non-polar column, custom temperature program

View large format table.

Column type Active phase I Reference Comment
CapillaryDB-11123.Delort and Jaquier, 200960. m/0.25 mm/0.25 μm, Helium; Program: 50 0C (5 min) 3 0C/min -> 120 0C 5 0C/min -> 250 0C (3 min) 15 0C/min -> 300 0C (20 min)
CapillaryDB-11112.Mendes, Trindade, et al., 200930. m/0.25 mm/0.25 μm, Hydrogen; Program: 45 0C 3 0C/min -> 175 0C 15 0C/min -> 300 0C (10 min)
CapillaryHP-51139.Qiao, Xie, et al., 200830. m/0.25 mm/0.25 μm, Helium; Program: 40 0C (3 min) 3 0C/min -> 160 0C (2 min) 8 0C/min -> 220 0C (3 min)
CapillaryHP-51147.Qiao, Xie, et al., 200830. m/0.25 mm/0.25 μm, Helium; Program: not specified
CapillaryHP-51138.Zhao, Li, et al., 200830. m/0.25 mm/0.25 μm; Program: not specified
CapillaryCP Sil 8 CB1137.Butkienë, Nivinskienë, et al., 200550. m/0.32 mm/0.25 μm, He; Program: 50C(5min) => 2C/min => 90C => 15C/min => 240C(4min)
CapillarySE-301123.Vinogradov, 2004Program: not specified
CapillaryOV-1011125.Yang, 2001N2; Column length: 50. m; Column diameter: 0.25 mm; Program: not specified
CapillaryCP Sil 5 CB1129.Weyerstahl, Marschall, et al., 1997N2; Column length: 25. m; Program: not specified

Normal alkane RI, polar column, temperature ramp

View large format table.

Column type Active phase I Reference Comment
CapillaryCarbowax1458.Ferhat, Meklati, et al., 200760. m/0.2 mm/0.25 μm, He, 60. C @ 8. min, 2. K/min, 250. C @ 15. min
CapillaryBP-201470.Boti, Muselli, et al., 200650. m/0.22 mm/0.25 μm, He, 2. K/min, 220. C @ 20. min; Tstart: 60. C
CapillaryDB-Wax1462.Lan Phi N.T., Nishiyama C., et al., 200660. m/0.25 mm/0.25 μm, 70. C @ 2. min, 2. K/min, 230. C @ 20. min
CapillaryDB-Wax1463.Lan Phi N.T., Nishiyama C., et al., 200660. m/0.25 mm/0.25 μm, 70. C @ 2. min, 2. K/min, 230. C @ 20. min
CapillaryDB-Wax1465.Sawamura, Onishi, et al., 200660. m/0.25 mm/0.25 μm, 70. C @ 2. min, 2. K/min, 230. C @ 20. min
CapillaryDB-Wax1481.Njoroge, Koaze, et al., 200560. m/0.25 mm/0.25 μm, N2, 70. C @ 2. min, 2. K/min, 230. C @ 20. min
CapillaryDB-Wax1465.Njoroge, Koaze, et al., 2005, 260. m/0.25 mm/0.25 μm, N2, 70. C @ 2. min, 2. K/min, 230. C @ 20. min
CapillaryDB-Wax1472.Choi, 200460. m/0.25 mm/0.25 μm, N2, 70. C @ 2. min, 2. K/min, 230. C @ 20. min
CapillaryDB-Wax1482.Sawamura, Son, et al., 200460. m/0.25 mm/0.25 μm, 70. C @ 2. min, 2. K/min, 230. C @ 20. min
CapillaryDB-Wax1437.Tu, Onishi, et al., 200360. m/0.25 mm/0.25 μm, N2, 70. C @ 2. min, 2. K/min, 230. C @ 20. min
CapillaryDB-Wax1458.Tu, Onishi, et al., 200260. m/0.25 mm/0.25 μm, N2, 70. C @ 2. min, 2. K/min, 230. C @ 20. min
CapillaryDB-Wax1472.Tu, Thanh, et al., 200260. m/0.25 mm/0.25 μm, N2, 2. K/min; Tstart: 70. C; Tend: 230. C
CapillaryDB-Wax1442.Umano, Hagi, et al., 200260. m/0.25 mm/0.25 μm, He, 40. C @ 2. min, 2. K/min; Tend: 200. C
CapillaryInnowax1468.Kaya, Baser, et al., 199960. m/0.25 mm/0.25 μm, He, 60. C @ 10. min; Tend: 220. C
CapillaryHP-Innowax1468.Kaya, Baser, et al., 1999, 260. m/0.25 mm/0.25 μm, He, 60. C @ 10. min; Tend: 220. C

Normal alkane RI, polar column, custom temperature program

View large format table.

Column type Active phase I Reference Comment
CapillaryHP-Innowax FSC1468.Erdurak, Coskun, et al., 200660. m/0.25 mm/0.25 μm, He; Program: 60C(10min) => 4C/min => 220C (10min) => 1C/min => 240C
CapillaryInnowax FSC1468.Kosar, Özek, et al., 200560. m/0.25 mm/0.25 μm, He; Program: 60C(10min) => 4C/min => 220C(10min) => 1C/min => 240C
CapillaryHP-Innowax FSC1468.Viljoen, Subramoney, et al., 200560. m/0.25 mm/0.25 μm, He; Program: 60C(10min) => 4C/min => 220C(10min) => 1C/min => 240C
CapillaryCarbowax 20M1461.Vinogradov, 2004Program: not specified
CapillaryInnowax FSC1468.Baser, Demirci, et al., 200360. m/0.25 mm/0.25 μm, He; Program: 60C(10min) => 4C/min => 220C (10min) => 1C/min => 240C
CapillaryInnowax FSC1468.Baser, Demirei, et al., 200260. m/0.25 mm/0.25 μm, He; Program: 60C(10min) => 4C/min => 220C(10min) => 1C/min => 240C
CapillaryInnowax1468.Baser, Özek, et al., 200060. m/0.25 mm/0.25 μm, He; Program: 60 0C (10 min) 4 K/min -> 220 0C (10 min) 1 K/min -> 240 0C

References

Gkinis, Tzakou, et al., 2003
Gkinis, G.; Tzakou, O.; Iliopoulou, D.; Roussis, V., Chemical Composition and Biological Activity of Nepeta parnassica Oils and Isolated Nepetalactones, Z. Naturforsch. C:, 2003, 58, 681-686. [all data]

Palá-Paúl, Velasco-Negueruela, et al., 2002
Palá-Paúl, J.; Velasco-Negueruela, A.; Pérez-Alonso, M.J.; Sanz, J., Essential oil composition of the aerial parts of Cachrys sicula L., Flavour Fragr. J., 2002, 17, 1, 64-68, https://doi.org/10.1002/ffj.1042 . [all data]

Adams, 2000
Adams, R.P., Systematics of the one seeded Juniperus of the eastern hemisphere based on leaf essential oils and random amplified polymorphic DNAs (RAPDs), Biochem. Syst. Ecol., 2000, 28, 6, 529-543, https://doi.org/10.1016/S0305-1978(99)00096-4 . [all data]

Sajjadi and Ghassemi, 1999
Sajjadi, S.E.; Ghassemi, N., Volatile constituents of Nepeta glomerulosa Boiss. subsp. carmanica, Flavour Fragr. J., 1999, 14, 5, 265-267, https://doi.org/10.1002/(SICI)1099-1026(199909/10)14:5<265::AID-FFJ822>3.0.CO;2-A . [all data]

Jantan, Ahmad, et al., 1996
Jantan, I.; Ahmad, A.S.; Ahmad, A.R.; Ali, N.A.M.; Ayop, N., Chemical composition of some citrus oils from Malaysia, J. Essent. Oil Res., 1996, 8, 6, 627-632, https://doi.org/10.1080/10412905.1996.9701030 . [all data]

Padrayuttawat, Tamura, et al., 1996
Padrayuttawat, A.; Tamura, H.; Yamao, M., A split injection system for the analysis of purge and trap headspace of the volatile components in Citrus sudachi, J. Hi. Res. Chromatogr., 1996, 19, 6, 365-369, https://doi.org/10.1002/jhrc.1240190613 . [all data]

El-Shazly, Dorai, et al., 2002
El-Shazly, A.; Dorai, G.; Wink, M., Composition and antimicrobial activity of essential oil and hexane-ether extract of Tanacetum santolinoides (DC.) Feinbr. and Fertig, Z. Naturforsch., 2002, 57c, 620-623. [all data]

Umano and Shibamoto, 1988
Umano, K.; Shibamoto, T., A new method of headspace sampling: grapefruit volatiles in Flavors and Fragrances: A World Perspective. Proceedings of the 10th International Congress of Essential Oils, Fragrances and Flavors, Lawrence,B.M.; Mookherjee,B.D.; Willis,B.J., ed(s)., Elsevier, New York, 1988, 981-998. [all data]

Benkaci-Ali, Baaliouamer, et al., 2007
Benkaci-Ali, F.; Baaliouamer, A.; Meklati, B.Y.; Chemat, F., Chemical composition of seed essential oils from Algerian Nigella sativa extracted by microwave and hydrodistillation, Flavour Fragr. J., 2007, 22, 2, 148-153, https://doi.org/10.1002/ffj.1773 . [all data]

Dugo, Mondello, et al., 2005
Dugo, P.; Mondello, L.; Favoino, O.; Cicero, L.; Rodriguez Zenteno, N.A.; Dugo, G., Characterization of cold-pressed Mexican dancy tangerine oils, Flavour Fragr. J., 2005, 20, 1, 60-66, https://doi.org/10.1002/ffj.1367 . [all data]

Fanciullino, Gancel, et al., 2005
Fanciullino, A.-L.; Gancel, A.-L.; Froelicher, Y.; Luro, F.; Ollitrault, P.; Brillouet, J.-M., Effects of Nucleo-cytoplasmic Interactions on Leaf Volatile Compounds from Citrus Somatic Diploid Hybrids, J. Agric. Food Chem., 2005, 53, 11, 4517-4523, https://doi.org/10.1021/jf0502855 . [all data]

Gancel, Ollitrault, et al., 2005
Gancel, A.-L.; Ollitrault, P.; Froelicher, Y.; Tomi, F.; Jacquemond, C.; Luro, F.; Brillouet, J.-M., Leaf volatile compounds of six citrus somatic allotetraploid hybrids originating from various combinations of lime, lemon, citron, sweet orange, and grapefruit, J. Agric. Food Chem., 2005, 53, 6, 2224-2230, https://doi.org/10.1021/jf048315b . [all data]

Smadja, Rondeau, et al., 2005
Smadja, J.; Rondeau, P.; Sing, A.S.C., Volatile constituents of five Citrus Petitgrain essential oils from Reunion, Flavour Fragr. J., 2005, 20, 4, 399-402, https://doi.org/10.1002/ffj.1438 . [all data]

Verzera, Trozzi, et al., 2005
Verzera, A.; Trozzi, A.; Zappala, M.; Condurso, C.; Cotroneo, A., Essential Oil Composition of Citrus meyerii Y. Tan. and Citrus medica L. cv. Diamante and Their Lemon Hybrids, J. Agric. Food Chem., 2005, 53, 12, 4890-4894, https://doi.org/10.1021/jf047879c . [all data]

Chisholm, Wilson, et al., 2003
Chisholm, M.G.; Wilson, M.A.; Gaskey, G.M., Characterization of aroma volatiles in key lime essential oils (Cirtrus aurantifolia Swingle), Flavour Fragr. J., 2003, 18, 2, 106-115, https://doi.org/10.1002/ffj.1172 . [all data]

Choi, 2003
Choi, H.-S., Character impact odorants of Citrus Hallabong [(C. unshiu Marcov × C. sinensis Osbeck) × C. reticulata Blanco] cold-pressed peel oil, J. Agric. Food Chem., 2003, 51, 9, 2687-2692, https://doi.org/10.1021/jf021069o . [all data]

Gancel, Ollitrault, et al., 2003
Gancel, A.-L.; Ollitrault, P.; Froelicher, Y.; Tomi, F.; Jacquemond, C.; Luro, F.; Brillouet, J.-M., Leaf volatile compounds of seven citrus somatic tetraploid hybrids sharing willow leaf mandarin (Citrus deliciosa Ten.) as their common parent, J. Agric. Food Chem., 2003, 51, 20, 6006-6013, https://doi.org/10.1021/jf0345090 . [all data]

Högnadóttir and Rouseff, 2003
Högnadóttir, Á.; Rouseff, R.L., Identification of aroma active compounds in organce essence oil using gas chromatography-olfactometry and gas chromatography-mass spectrometry, J. Chromatogr. A, 2003, 998, 1-2, 201-211, https://doi.org/10.1016/S0021-9673(03)00524-7 . [all data]

Jantan, Ling, et al., 2003
Jantan, I.; Ling, Y.E.; Romli, S.; Ayop, N.; Ahmad, A.S., A comparative study of the constituents of the essential oils of three Cinnamomum species from Malaysia, J. Essent. Oil Res., 2003, 15, 6, 387-391, https://doi.org/10.1080/10412905.2003.9698618 . [all data]

Mimica-Dukic, Kujundzic, et al., 2003
Mimica-Dukic, N.; Kujundzic, S.; Sokovic, M.; Couladis, M., Essential oil composition and antifungal activity of Foeniculum vulgare Mill. obtained by different distillation conditions, Phytother. Res., 2003, 17, 4, 368-371, https://doi.org/10.1002/ptr.1159 . [all data]

Verzera, Trozzi, et al., 2003
Verzera, A.; Trozzi, A.; Gazea, F.; Cicciarelloi, G.; Cotroneo, A., Effects of rootstock on the composition of bergamot (Citrus bergamia Risso et Poiteau) essential oil, J. Agric. Food Chem., 2003, 51, 1, 206-210, https://doi.org/10.1021/jf0206872 . [all data]

Choi, Kim. M.-S.L., et al., 2002
Choi, H.-S.; Kim. M.-S.L.; Sawamura, M., Constituents of the essential oil of cnidium officinale Makino, a Korean medicinal plant, Flavour Fragr. J., 2002, 17, 1, 49-53, https://doi.org/10.1002/ffj.1038 . [all data]

Lota, de Rocca Serra, et al., 2002
Lota, M.-L.; de Rocca Serra, D.; Tomi, F.; Jacquemond, C.; Casanova, J., Volatile components of peel and leaf oils of lemon and lime species, J. Agric. Food Chem., 2002, 50, 4, 796-805, https://doi.org/10.1021/jf010924l . [all data]

Chisholm, Wilson, et al., 2001
Chisholm, M.G.; Wilson, M.A.; Gaskey, G.M.; Jell, J.A.; Cass, D.M., Jr., Chapter 9. The identification of aroma compounds in key lime oil using solid-phase microextraction and gas chromatography-olfactometry, Am. Chem. Soc. Symp. Ser., 2001, 782, 100-112. [all data]

Kim, Thuy, et al., 2000
Kim, T.H.; Thuy, N.T.; Shin, J.H.; Baek, H.H.; Lee, H.J., Aroma-active compounds of miniature beefsteakplant (Mosla dianthera Maxim.), J. Agric. Food Chem., 2000, 48, 7, 2877-2881, https://doi.org/10.1021/jf000219x . [all data]

Lota, de Rocca Serra, et al., 2000
Lota, M.-L.; de Rocca Serra, D.; Tomi, F.; Casanova, J., Chemical variability of peel and leaf essential oils of mandarins from Citrus reticulata Blanco, Biochem. Syst. Ecol., 2000, 28, 1, 61-78, https://doi.org/10.1016/S0305-1978(99)00036-8 . [all data]

Song, Sawamura, et al., 2000
Song, H.S.; Sawamura, M.; Ito, T.; Kawashimo, K.; Ukeda, H., Quantitative determination of characteric flavour of Citrus junos (yuzu) peel oil, Flavour Fragr. J., 2000, 15, 4, 245-250, https://doi.org/10.1002/1099-1026(200007/08)15:4<245::AID-FFJ904>3.0.CO;2-V . [all data]

Song, Sawamura, et al., 2000, 2
Song, H.S.; Sawamura, M.; Ito, T.; Ido, A.; Ukeda, H., Quantitative determination and characteristic flavour of daidai (Citrus aurantium L. var. cyathifera Y. Tanaka) peel oil, Flavour Fragr. J., 2000, 15, 5, 323-328, https://doi.org/10.1002/1099-1026(200009/10)15:5<323::AID-FFJ918>3.0.CO;2-J . [all data]

Verzera, la Rosa, et al., 2000
Verzera, A.; la Rosa, G.; Zappalà, M.; Cotroneo, A., Essential oil composition of different cultivars of bergamot grown in Sicily, Ital. J. Food Sci., 2000, 12, 4, 493-501. [all data]

Verzera, Trozzi, et al., 2000
Verzera, A.; Trozzi, A.; Cotroneo, A.; Lorenzo, D.; Dellacassa, E., Uruguayan essential oil. 12. Composition of Nova and Satsuma mandarin oils, J. Agric. Food Chem., 2000, 48, 7, 2903-2909, https://doi.org/10.1021/jf990734z . [all data]

Lota, Serra, et al., 1999
Lota, M.-L.; Serra, D.R.; Tomi, F.; Bessiere, J.-M.; Casanova, J., Chemical composition of peel and leaf essential oils of Citrus medica L. and C. limonimedica Lush., Flavour Fragr. J., 1999, 14, 3, 161-166, https://doi.org/10.1002/(SICI)1099-1026(199905/06)14:3<161::AID-FFJ801>3.0.CO;2-8 . [all data]

Yang, Sugisawa, et al., 1992
Yang, R.; Sugisawa, H.; Nakatani, H.; Tamura, H.; Takagi, N., Comparison of odor quality in peel oils of acid citrus, Nippon Shokuhin Kogyo Gakkaishi, 1992, 39, 1, 16-24, https://doi.org/10.3136/nskkk1962.39.16 . [all data]

Andriamaharavo, 2014
Andriamaharavo, N.R., Retention Data. NIST Mass Spectrometry Data Center., NIST Mass Spectrometry Data Center, 2014. [all data]

Cardeal, da Silva, et al., 2006
Cardeal, Z.L.; da Silva, M.D.R.G.; Marriott, P.J., Comprehensive two-dimensional gas chromatography/mass spectrometric analysis of pepper volatiles, Rapid Commun. Mass Spectrom., 2006, 20, 19, 2823-2836, https://doi.org/10.1002/rcm.2665 . [all data]

Mondello, Dugo, et al., 1995
Mondello, L.; Dugo, P.; Basile, A.; Dugo, G., Interactive use of linear retention indices, on polar and apolar columns, with a MS-library for reliable identification of complex mixtures, J. Microcolumn Sep., 1995, 7, 6, 581-591, https://doi.org/10.1002/mcs.1220070605 . [all data]

Ferhat, Meklati, et al., 2007
Ferhat, M.A.; Meklati, B.Y.; Chemat, F., Comparison of different isolation methods of essential oil from Citrus fruits: cold pressing, hydrodistillation and microwave dry distillation, Flavour Fragr. J., 2007, 22, 6, 494-504, https://doi.org/10.1002/ffj.1829 . [all data]

Hnawia, Cabalion, et al., 2007
Hnawia, E.; Cabalion, P.; Raunicher, I.; Waikedre, J.; Patissou, J.; Buchbauer, G.; Menut, C., The leaf essential oil of Murraya crenulata (Turcz.) Oliver from New Caledonia, Flavour Fragr. J., 2007, 22, 1, 32-34, https://doi.org/10.1002/ffj.1745 . [all data]

Monser-Esfahani, Karamkhani, et al., 2007
Monser-Esfahani, H.R.; Karamkhani, F.; Nickavar, B.; Abdi, K.; Faramarzi, M.A., The Volatile Constituents of Dracocephalum kotschyi Oils, Chem. Nat. Comp., 2007, 43, 1, 40-43, https://doi.org/10.1007/s10600-007-0027-z . [all data]

Askari and Sefidkon, 2006
Askari, F.; Sefidkon, F., Essential oil composition of Pimpinella affinis Ledeb. from two localities in Iran, Flavour Fragr. J., 2006, 21, 5, 754-756, https://doi.org/10.1002/ffj.1619 . [all data]

Boti, Muselli, et al., 2006
Boti, J.B.; Muselli, A.; Tomi, F.; Koukoua, G.; N'Guessan, T.Y.; Costa, J.; Casanova, J., Combined analysis of Cymbopogon giganteus Chiov. leaf oil from Ivory Coast by GC/RI, GC/MS and 13C-NMR, C.R. Chim., 2006, 9, 1, 164-168, https://doi.org/10.1016/j.crci.2005.10.003 . [all data]

Javidnia, Miri, et al., 2006
Javidnia, K.; Miri, R.; Kamalinejad, M.; Mehdipour, A.R., Composition of the essential oil of Diplotaenia cachrydifolia Boiss. from Iran, J. Ess. Oil Res., 2006, 18, 1, 86-87, https://doi.org/10.1080/10412905.2006.9699393 . [all data]

Lan Phi N.T., Nishiyama C., et al., 2006
Lan Phi N.T.; Nishiyama C.; Choi H.-S.; Sawamura M., Evaluation of aroma characteristic compounds of Citrus natsudaidai Hayata (Natsudaidai) cold-pressed peel oil, Biosci. Biotechnol. Biochem., 2006, 70, 8, 1832-1838, https://doi.org/10.1271/bbb.50705 . [all data]

Lis and Milczarek, 2006
Lis, A.; Milczarek, J., Chemical composition of the essential oils from fruits, leaves and flowers of Phellodendron sachalinense (Fr. Schmidt) Sarg., Flavour Fragr. J., 2006, 21, 4, 683-686, https://doi.org/10.1002/ffj.1662 . [all data]

Sawamura, Onishi, et al., 2006
Sawamura, M.; Onishi, Y.; Ikemoto, J.; Tu, N.T.M.; Phi, N.T.L., Characteristic odour components of bergamot (Citrus bergamia Risso) essential oil, Flavour Fragr. J., 2006, 21, 4, 609-615, https://doi.org/10.1002/ffj.1604 . [all data]

Sefidkon, Jamzad, et al., 2006
Sefidkon, F.; Jamzad, Z.; Mirza, M., Chemical composition of the essential oil of five Iranian Nepeta species (N. crispa, N. mahanensis, N. ispahanica, N. eremophila and N. rivularis), Flavour Fragr. J., 2006, 21, 5, 764-767, https://doi.org/10.1002/ffj.1668 . [all data]

Jirovetz, Buchbauer, et al., 2005
Jirovetz, L.; Buchbauer, G.; Stoyanova, A.; Georgiev, E.V.; Damianova, S.T., Composition, quality control and antimicrobial activity of the essential oil of cumin (Cuminum cyminumL.) seeds from Bulgaria that had been stored for up to 36 years, Int. J. Food Sci. Technol., 2005, 40, 3, 305-310, https://doi.org/10.1111/j.1365-2621.2004.00915.x . [all data]

Sefidkon and Jamzad, 2005
Sefidkon, F.; Jamzad, Z., Chemical composition of the essential oil of three Iranian Satureja species (S. mutica, S. macrantha and S. intermedia), Food Chem., 2005, 91, 1, 1-4, https://doi.org/10.1016/j.foodchem.2004.01.027 . [all data]

da Silva, Andrade, et al., 2005
da Silva, M.H.L.; Andrade, E.H.A.; Mala, J.G.S., The essential oil of Pectis elongata Kunth occurring in north Brazil, Flavour Fragr. J., 2005, 20, 5, 462-464, https://doi.org/10.1002/ffj.1546 . [all data]

Sonboli, Salehi, et al., 2005
Sonboli, A.; Salehi, P.; Allahyari, L., Essential oil composition of Nepeta involucrata from Iran, Chem. Nat. Compd. (Engl. Transl.), 2005, 41, 6, 683-685, https://doi.org/10.1007/s10600-006-0011-z . [all data]

Palá-Paúl, Velasco-Negueruela, et al., 2004
Palá-Paúl, J.; Velasco-Negueruela, A.; Pérez-Alonso, M.J.; Maqueda, J.; Sanz, J., Volatile oil constituents from different parts of Cachrys trifida L., J. Essent. Oil Res., 2004, 16, 4, 347-349, https://doi.org/10.1080/10412905.2004.9698738 . [all data]

Sawamura, Son, et al., 2004
Sawamura, M.; Son, U.-S.; Choi, H.-S.; Kim, M.-S.L.; Phi, N.T.L.; Fears, M.; Kumagai, Compositional changes in commercial lemon essential oil for aromatherapy, Int. J. Aromatherapy, 2004, 14, 1, 27-36, https://doi.org/10.1016/j.ijat.2004.02.001 . [all data]

Jirovetz, Buchbauer, et al., 2003
Jirovetz, L.; Buchbauer, G.; Stoyanova, A.S.; Georgiev, E.V.; Damianova, S.T., Composition, quality control, and antimicrobial activity of the essential oil of long-time stored dill (Anethum graveolens L.) seeds from Bulgaria, J. Agric. Food Chem., 2003, 51, 13, 3854-3857, https://doi.org/10.1021/jf030004y . [all data]

Mookdasanit, Tamura, et al., 2003
Mookdasanit, J.; Tamura, H.; Yoshizawa T.; Tokunaga T.; Nakanishi, K., Trace Volatile Compounds in Essential Oil of Citrus Sudachi by Means of Modified Solvent Extraction Method, Food Sci Technol. Res., 2003, 9, 1, 54-61, https://doi.org/10.3136/fstr.9.54 . [all data]

Tu, Onishi, et al., 2003
Tu, N.T.M.; Onishi, Y.; Son, U.S.; Ogawa, E.; Ukeda, H.; Sawamura, M., Characteristic odour components of Citrus inflata Hort. Ex Tanaka (Mochiyu) cold-pressed peel oil, Flavour Fragr. J., 2003, 18, 5, 454-459, https://doi.org/10.1002/ffj.1252 . [all data]

Yang, 2001
Yang, R., Analysis of the volatile components in peel oil of Yuzu by gas chromatography/mass spectrometry, Chin. J. Anal. Chem., 2001, 29, 3, 313-316. [all data]

Yang, 2001, 2
Yang, R., Volatile compounds in peel oil of Citrus sudachi, Food Sci. (Beijing), 2001, 22, 3, 71-73. [all data]

Mitiku, Sawamura, et al., 2000
Mitiku, S.B.; Sawamura, M.; Itoh, T.; Ukeda, H., Volatile components of peel cold-pressed oils of two cultivars of sweet orange (Citrus sinensis (L.) Osbeck) from Ethiopia, Flavour Fragr. J., 2000, 15, 4, 240-244, https://doi.org/10.1002/1099-1026(200007/08)15:4<240::AID-FFJ902>3.0.CO;2-F . [all data]

Tamura, Yang, et al., 1993
Tamura, H.; Yang, R.-H.; Sugisawa, H., Aroma profiles of peel oils of acid citrus, ACS Sym. Ser., 1993, 525, 121-136. [all data]

Delort and Jaquier, 2009
Delort, E.; Jaquier, A., Novel terpenyl esters from Australian finger lime (Citrus australasica) peel extract, Flav. Fragr. J., 2009, 24, 3, 123-132, https://doi.org/10.1002/ffj.1922 . [all data]

Mendes, Trindade, et al., 2009
Mendes, M.D.; Trindade, H.; Figueiredo, A.C.; Barroso, J.G.; Fontinha, S.S.; Pedro, L.G., Volatile and molecular characterization of two Portuguese endemic species: Angelica lignescens and Melanoselinium decipiens, Biochen. Systematics Ecol., 2009, 37, 2, 98-105, https://doi.org/10.1016/j.bse.2008.12.006 . [all data]

Qiao, Xie, et al., 2008
Qiao, Y.; Xie, B.J.; Zhang, Y.; Zhang, Y.; FAn, G.; Yao, X.L.; Pan, S.Y., Characterization of aroma active compounds in fruit juice and peel oil of Junchen sweet orange fruit (Citrus sinensis (L.) Osbeck) by GC-MS and GC-O, Molecules, 2008, 13, 6, 1333-1344, https://doi.org/10.3390/molecules13061333 . [all data]

Zhao, Li, et al., 2008
Zhao, Y.; Li, J.; Xu, Y.; Duan, H.; Fan, W.; Zhao, G., EXtraction, preparation and identification of volatile compounds in Changyu XO brandy, Chinese J. Chromatogr., 2008, 26, 2, 212-222, https://doi.org/10.1016/S1872-2059(08)60014-0 . [all data]

Butkienë, Nivinskienë, et al., 2005
Butkienë, R.; Nivinskienë, O.; Mockutë, D., α-Pinene chemotype of leaf (needle) essential oils of Juniperus communis L. growing wild in Vilnius district, Chemija, 2005, 16, 1, 53-60. [all data]

Vinogradov, 2004
Vinogradov, B.A., Production, composition, properties and application of essential oils, 2004, retrieved from http://viness.narod.ru. [all data]

Weyerstahl, Marschall, et al., 1997
Weyerstahl, P.; Marschall, H.; Seelmann, I.; Kaul, V.K., Constituents of the flower essential oil of Ageratina adenophora (Spreng.) K. et R. from India, Flavour Fragr. J., 1997, 12, 6, 387-396, https://doi.org/10.1002/(SICI)1099-1026(199711/12)12:6<387::AID-FFJ677>3.0.CO;2-F . [all data]

Njoroge, Koaze, et al., 2005
Njoroge, S.M.; Koaze, H.; Mwaniki, M.; Minh Tu, N.T.; Sawamura, M., Essential oils of Kenyan Citrus fruits: volatile components of two varieties of mandarins (Citrus reticulata) and a tangelo (C. paradisi × C. tangerina), Flavour Fragr. J., 2005, 20, 1, 74-79, https://doi.org/10.1002/ffj.1376 . [all data]

Njoroge, Koaze, et al., 2005, 2
Njoroge, S.M.; Koaze, H.; Karanja, P.N.; Sawamura, M., Essential oil constituents of three varieties of Kenyan sweet oranges (Citrus sinensis), Flavour Fragr. J., 2005, 20, 1, 80-85, https://doi.org/10.1002/ffj.1377 . [all data]

Choi, 2004
Choi, H.-S., Aroma evaluation of an aquatic herb, changpo (Acorus calamus Var. angustatus Bess), by AEDA and SPME, J. Agric. Food Chem., 2004, 52, 26, 8099-8104, https://doi.org/10.1021/jf040239p . [all data]

Tu, Onishi, et al., 2002
Tu, N.T.M.; Onishi, Y.; Choi, H.-S.; Kondo, Y.; Bassore, S.M.; Ukeda, H.; Sawamura, M., Characteristic odor components of Citrus sphaerocarpa Tanaka (Kabosu) cold-pressed peel oil, J. Agric. Food Chem., 2002, 50, 10, 2908-2913, https://doi.org/10.1021/jf011578a . [all data]

Tu, Thanh, et al., 2002
Tu, N.T.M.; Thanh, L.X.; Une, A.; Ukeda, H.; Sawamura, M., Volatile constituents of Vietnamese pummelo, orange, tangerine and lime peel oils, Flavour Fragr. J., 2002, 17, 3, 169-174, https://doi.org/10.1002/ffj.1076 . [all data]

Umano, Hagi, et al., 2002
Umano, K.; Hagi, Y.; Shibamoto, T., Volatile chemicals identified in extracts from newly hybrid citrus, dekopon (Shiranuhi mandarin Suppl. J.), J. Agric. Food Chem., 2002, 50, 19, 5355-5359, https://doi.org/10.1021/jf0203951 . [all data]

Kaya, Baser, et al., 1999
Kaya, A.; Baser, K.H.C.; Demirci, B.; Koca, F., The essential oil of Acinos alpinus (L.) Moench growing in Turkey, Flavour Fragr. J., 1999, 14, 1, 55-59, https://doi.org/10.1002/(SICI)1099-1026(199901/02)14:1<55::AID-FFJ784>3.0.CO;2-Q . [all data]

Kaya, Baser, et al., 1999, 2
Kaya, A.; Baser, K.H.C.; Tümen, G.; Koca, F., The essential oil of Acinos suaveolens (Sm.) G. Don fil. Acinos arvensis (Lam.) Dandy and Acinos rotundifolius Pers. growing wild in Turkey, Flavour Fragr. J., 1999, 14, 1, 60-64, https://doi.org/10.1002/(SICI)1099-1026(199901/02)14:1<60::AID-FFJ785>3.0.CO;2-0 . [all data]

Erdurak, Coskun, et al., 2006
Erdurak, C.S.; Coskun, M.; Demirci, B.; Baser, K.H.C., Composition of the essential oil of fruits and roots of Ferulago isaurica Pesmen and F. syriaca Boiss. (Umbelliferae) from Turkey, Flavour Fragr. J., 2006, 21, 1, 118-121, https://doi.org/10.1002/ffj.1540 . [all data]

Kosar, Özek, et al., 2005
Kosar, M.; Özek, T.; Göger, F.; Kürkcüoglu, M.; Hüsnü Can Baser, K., Comparison of Microwave-Assisted Hydrodistillation and Hydrodistillation Methods for the Analysis of Volatile Secondary Metabolites, Pharm. Biol., 2005, 43, 6, 491-495, https://doi.org/10.1080/13880200500220136 . [all data]

Viljoen, Subramoney, et al., 2005
Viljoen, A.M.; Subramoney, S.; van Vuuren, S.F.; Baser, K.H.C.; Demirci, B., The composition, geographical variation and antimicrobial activity of Lippia javanica (Verbenaceae) leaf essential oils, J. Ethnopharmacol., 2005, 96, 1-2, 271-277, https://doi.org/10.1016/j.jep.2004.09.017 . [all data]

Baser, Demirci, et al., 2003
Baser, K.H.C.; Demirci, B.; Dekebo, A.; Dagne, E., Essential oils of some Boswellia spp., myrrh and opopanax, Flavour Fragr. J., 2003, 18, 2, 153-156, https://doi.org/10.1002/ffj.1166 . [all data]

Baser, Demirei, et al., 2002
Baser, K.H.C.; Demirei, B.; Özek, T.; Akalin, E.; Özhatay, N., Micro-distilled volatile compounds from Ferulago species growing in Western Turkey, Pharm. Biol., 2002, 40, 6, 466-471, https://doi.org/10.1076/phbi.40.6.466.8439 . [all data]

Baser, Özek, et al., 2000
Baser, K.H.C.; Özek, T.; Demirci, B.; Duman, H., Composition of the essential oil of Glaucosciadium cordifolium (Boiss.) Burtt et Davis from Turkey, Flavour Fragr. J., 2000, 15, 1, 45-46, https://doi.org/10.1002/(SICI)1099-1026(200001/02)15:1<45::AID-FFJ867>3.0.CO;2-L . [all data]