β-Bisabolene

Kovats' RI, non-polar column, temperature ramp

Data compiled by: NIST Mass Spectrometry Data Center, William E. Wallace, director

Column type CapillaryCapillaryCapillaryCapillaryCapillary
Active phase DB-1HP-5MSDB-5BP-1DB-5
Column length (m) 30.30.30.30.30.
Carrier gas HeHeHeN2
Substrate
Column diameter (mm) 0.250.250.250.320.25
Phase thickness (μm) 0.250.250.250.250.25
Tstart (C) 50.60.60.60.40.
Tend (C) 280.280. 220.210.
Heat rate (K/min) 5.2.3.5.2.
Initial hold (min) 3.8.  2.
Final hold (min)  30. 3.33.
I 1503.1506.1509.1503.1512.
ReferenceAllegrone, Belliardo, et al., 2006Hazzit, Baaliouamer, et al., 2006Lucero, Fredrickson, et al., 2006Srivastava, Srivastava, et al., 2006Sylvestre, Pichette, et al., 2006
Comment MSDC-RI MSDC-RI MSDC-RI MSDC-RI MSDC-RI
Column type CapillaryCapillaryCapillaryCapillaryCapillary
Active phase HP-5MSHP-5MSDB-5SPB-1HP-5MS
Column length (m) 30.30. 30.30.
Carrier gas HeHe HeHe
Substrate
Column diameter (mm) 0.250.25 0.320.25
Phase thickness (μm) 0.250.25 0.250.25
Tstart (C) 50.50.60.50.60.
Tend (C) 240.250.240.250.200.
Heat rate (K/min) 3.3.3.2.4.
Initial hold (min)  10. 2.1.
Final hold (min)  5. 5.15.
I 1547.1511.1509.1490.1506.
ReferenceTepe, Askin Akpulat, et al., 2006Asuming, Beauchamp, et al., 2005Shatar S., 2005Behera, Nagarajan, et al., 2004Juliani, Zygadlo, et al., 2004
Comment MSDC-RI MSDC-RI MSDC-RI MSDC-RI MSDC-RI
Column type CapillaryCapillaryCapillaryCapillaryCapillary
Active phase HP-5DB-5DB-5HP-5MSHP-5MS
Column length (m) 30.25.50.30.30.
Carrier gas HeHeHeHeHe
Substrate
Column diameter (mm) 0.250.250.320.250.25
Phase thickness (μm) 0.25 0.250.250.25
Tstart (C) 60.40.50.50.60.
Tend (C) 260.280.280.280.280.
Heat rate (K/min) 3.3.5.4.3.
Initial hold (min)  5.2.2.
Final hold (min)  5.10.10.
I 1509.1506.1525.1517.1489.
ReferenceLopes, Strobl, et al., 2004Amparo Blázquez, Pérez, et al., 2003Baranauskiene, Venskutonis, et al., 2003Baranauskiene, Venskutonis, et al., 2003, 2Gkinis, Tzakou, et al., 2003
Comment MSDC-RI MSDC-RI MSDC-RI MSDC-RI MSDC-RI
Column type CapillaryCapillaryCapillaryCapillaryCapillary
Active phase CP Sil 5 CBBP-1SPB-1HP-5DB-1
Column length (m) 25.25.30.30.25.
Carrier gas HeN2HeHeHe
Substrate
Column diameter (mm) 0.250.320.320.250.2
Phase thickness (μm) 0.150.250.250.25
Tstart (C) 50.60.60.60.60.
Tend (C) 230.220.225.200.220.
Heat rate (K/min) 3.5.2.4.3.
Initial hold (min)   3.1.
Final hold (min)  15.5.15.
I 1505.1507.1476.1509.1506.
ReferenceOgunwande, Olawore, et al., 2003Raina, Srivastava, et al., 2003Jayaprakasha, Jena, et al., 2002Juliani and Simon, 2002Mevy, Bessiere, et al., 2002
Comment MSDC-RI MSDC-RI MSDC-RI MSDC-RI MSDC-RI
Column type CapillaryCapillaryCapillaryCapillaryCapillary
Active phase BP-1BP-1HP-5MSBP-1HP-1
Column length (m) 25.25.30.30.25.
Carrier gas N2N2HeN2He
Substrate
Column diameter (mm) 0.320.550.250.320.2
Phase thickness (μm) 0.250.250.250.250.25
Tstart (C) 60.60.50.60.100.
Tend (C) 220.220.250.220.220.
Heat rate (K/min) 5.5.3.5.4.
Initial hold (min)
Final hold (min) 15.15. 13.
I 1505.1501.1508.1510.1508.
ReferenceRaina, Srivastava, et al., 2002Raina, Srivastava, et al., 2002, 2Salido, Altarejos, et al., 2002Shawl, Srivastava, et al., 2002Rajeswara Rao, 2001
Comment MSDC-RI MSDC-RI MSDC-RI MSDC-RI MSDC-RI
Column type CapillaryCapillaryCapillaryCapillaryCapillary
Active phase HP-5SE-54DB-5SE-30OV-101
Column length (m) 30.30.30.25.25.
Carrier gas He HeHe
Substrate
Column diameter (mm) 0.250.260.260.20.32
Phase thickness (μm) 0.250.250.25
Tstart (C) 60.60.60.60.50.
Tend (C) 280.246.246.180.200.
Heat rate (K/min) 3.3.3.3.5.
Initial hold (min)    10.
Final hold (min)
I 1509.1509.1509.1503.1491.
ReferenceTzakou and Couladis, 2001Adams, 2000Adams, 1999Jantan I. and Ahmad A.S., 1999Kuiate, Zollo, et al., 1999
Comment MSDC-RI MSDC-RI MSDC-RI MSDC-RI MSDC-RI
Column type CapillaryCapillaryCapillaryCapillaryCapillary
Active phase HP-5HP-5MSMethyl SiliconeMethyl SiliconeCP Sil 5 CB
Column length (m) 30.30.30.25.30.
Carrier gas HeHeHeN2Ar
Substrate
Column diameter (mm) 0.250.320.320.50.25
Phase thickness (μm) 0.250.250.25 0.25
Tstart (C) 60.70.60.60.60.
Tend (C) 280.250.250.220.220.
Heat rate (K/min) 4.3.2.5.3.
Initial hold (min)  5.2.
Final hold (min)   5.
I 1507.1500.1497.1507.1500.
ReferenceSajjadi and Ghassemi, 1999Siani, Ramos, et al., 1999Adegoke, Rao, et al., 1998Mallavarapu, Rao, et al., 1998Szafranek, Malinski, et al., 1998
Comment MSDC-RI MSDC-RI MSDC-RI MSDC-RI MSDC-RI
Column type CapillaryCapillaryCapillaryCapillary
Active phase CP Sil 8 CBSE-30DB-1BP-1
Column length (m) 25.25.28.50.
Carrier gas ArN2HeH2
Substrate
Column diameter (mm) 0.150.20.250.33
Phase thickness (μm) 0.12 0.25
Tstart (C) 60.60.50.65.
Tend (C) 220.180.270.220.
Heat rate (K/min) 3.3.4.5.
Initial hold (min)  10.1.2.
Final hold (min)  1.
I 1507.1498.1498.1506.
ReferenceSzafranek, Malinski, et al., 1998Jantan, Ahmad, et al., 1996Saad, El-Sharkawy, et al., 1995Ekundayo, Laakso, et al., 1988
Comment MSDC-RI MSDC-RI MSDC-RI MSDC-RI

Van Den Dool and Kratz RI, non-polar column, temperature ramp

Data compiled by: NIST Mass Spectrometry Data Center, William E. Wallace, director

Column type CapillaryCapillaryCapillaryCapillaryCapillary
Active phase RTX-1Equity-5MSHP-5MSBP-1DB-5
Column length (m) 60.30.30.50.30.
Carrier gas HeHeHeHeHe
Substrate
Column diameter (mm) 0.220.250.250.220.25
Phase thickness (μm) 0.250.250.250.250.25
Tstart (C) 60.50.60.60.60.
Tend (C) 230.250.250.220.240.
Heat rate (K/min) 2.3.2.2.3.
Initial hold (min)   8.
Final hold (min) 30.10.30.20.
I 1500.1508.1505.1500.1509.
ReferenceBendahou, Muselli, et al., 2008Belsito E.L., Carbone C., et al., 2007Benkaci-Ali, Baaliouamer, et al., 2007Duquesnoy, Castola, et al., 2007Flamini, Cioni, et al., 2007
Comment MSDC-RI MSDC-RI MSDC-RI MSDC-RI MSDC-RI
Column type CapillaryCapillaryCapillaryCapillaryCapillary
Active phase HP-5HP-5HP-5MSDB-5RTX-1
Column length (m) 30.30.30.30.60.
Carrier gas N2N2He He
Substrate
Column diameter (mm) 0.250.250.250.220.22
Phase thickness (μm) 0.250.250.250.250.25
Tstart (C) 50.60.60.60.60.
Tend (C) 220.220.280.240.230.
Heat rate (K/min) 5.5.3.3.2.
Initial hold (min) 10.10. 2.
Final hold (min)     35.
I 1509.1509.1506.1511.1500.
ReferenceFlamini, Tebano, et al., 2007Flamini, Tebano, et al., 2007, 2Kundakovic, Fokialakis, et al., 2007Martins, Santos, et al., 2007Paolini J., Costa J., et al., 2007
Comment MSDC-RI MSDC-RI MSDC-RI MSDC-RI MSDC-RI
Column type CapillaryCapillaryCapillaryCapillaryCapillary
Active phase RTX-1HP-5DB-5DB-1DB-5
Column length (m) 60.30.30.60.30.
Carrier gas HeHeHeN2He
Substrate
Column diameter (mm) 0.220.250.250.250.25
Phase thickness (μm) 0.250.250.250.250.25
Tstart (C) 60.50.60.60.60.
Tend (C) 230.250.260.250.240.
Heat rate (K/min) 2.4.5.5.3.
Initial hold (min)  4.
Final hold (min) 35.10. 10.
I 1500.1509.1513.1507.1509.
ReferencePaolini, Muselli, et al., 2007Quijano, Salamanca, et al., 2007Sabulal, Dan, et al., 2007Sonboli, Azizian, et al., 2007Telascrea, de Araujo, et al., 2007
Comment MSDC-RI MSDC-RI MSDC-RI MSDC-RI MSDC-RI
Column type CapillaryCapillaryCapillaryCapillaryCapillary
Active phase HP-5MSDB-5RTX-1HP-5MSBP-1
Column length (m) 30.30.60.30.50.
Carrier gas HeHeHeHeHe
Substrate
Column diameter (mm) 0.250.20.220.250.22
Phase thickness (μm) 0.250.250.250.250.25
Tstart (C) 60.50.60.60.60.
Tend (C) 280.250.230.280.220.
Heat rate (K/min) 3.5.2.3.2.
Initial hold (min)  3.
Final hold (min)  15.45. 20.
I 1507.1496.1502.1508.1507.
ReferenceVagionas, Ngassapa, et al., 2007Blagojevic, Radulovic, et al., 2006Cavalli, Tomi, et al., 2006Chorianopoulos N., Evergets E., et al., 2006Duquesnoy, Dinh, et al., 2006
Comment MSDC-RI MSDC-RI MSDC-RI MSDC-RI MSDC-RI
Column type CapillaryCapillaryCapillaryCapillaryCapillary
Active phase HP-5BP-1HP-5DB-1HP-5MS
Column length (m) 30.50.30.30.30.
Carrier gas N2HeHeN2He
Substrate
Column diameter (mm) 0.250.220.250.250.25
Phase thickness (μm) 0.250.250.250.250.25
Tstart (C) 60.60.60.50.60.
Tend (C) 220.220.250.220.280.
Heat rate (K/min) 5.2.3.4.3.
Initial hold (min) 10.
Final hold (min)  20.
I 1508.1501.1508.1505.1505.
ReferenceFlamini, Tebano, et al., 2006Gonny, Cavaleiro, et al., 2006Javidnia, Miri, et al., 2006Kuiate, Bessière, et al., 2006Kukic J., Petrovic S., et al., 2006
Comment MSDC-RI MSDC-RI MSDC-RI MSDC-RI MSDC-RI
Column type CapillaryCapillaryCapillaryCapillaryCapillary
Active phase SPB-1OV-1SPB-1HP-5MSHP-5MS
Column length (m) 30.25.30.30.30.
Carrier gas HeHeHeHeHe
Substrate
Column diameter (mm) 0.20.250.20.250.25
Phase thickness (μm) 0.20.250.20.250.25
Tstart (C) 70.50.70.60.60.
Tend (C) 220.220.220.280.300.
Heat rate (K/min) 3.3.3.4.3.
Initial hold (min)  1. 5.
Final hold (min) 15.5.15.
I 1495.1509.1495.1499.1508.
ReferencePinto, Pina-Vaz, et al., 2006Rubiolo P., Matteodo M., et al., 2006Salgueiro L.R., Pinto E., et al., 2006Saroglou, Dorizas, et al., 2006Silva-Brandão, Solferini, et al., 2006
Comment MSDC-RI MSDC-RI MSDC-RI MSDC-RI MSDC-RI
Column type CapillaryCapillaryCapillaryCapillaryCapillary
Active phase DB-5HP-5CP Sil 5 CBBP-1HP-5
Column length (m) 30.30.25.50.30.
Carrier gas HeHeH2HeN2
Substrate
Column diameter (mm) 0.250.250.250.220.25
Phase thickness (μm) 0.250.25 0.250.25
Tstart (C) 50.40.80.60.60.
Tend (C) 250.300.270.220.220.
Heat rate (K/min) 5.4.10.2.5.
Initial hold (min) 2.5.  10.
Final hold (min)    20.
I 1506.1506.1503.1500.1509.
ReferenceSu, Ho, et al., 2006Vundac, Pfeifhofer, et al., 2006Ziegenbein, Hanssen, et al., 2006Boti J.B., Koukoua G., et al., 2005Celik, Gokturk, et al., 2005
Comment MSDC-RI MSDC-RI MSDC-RI MSDC-RI MSDC-RI
Column type CapillaryCapillaryCapillaryCapillaryCapillary
Active phase HP-5DB-1DB-1DB-1BP-1
Column length (m) 30.30.30.30.50.
Carrier gas N2N2N2N2He
Substrate
Column diameter (mm) 0.250.320.320.320.22
Phase thickness (μm) 0.250.250.250.250.25
Tstart (C) 60.50.50.50.60.
Tend (C) 220.260.260.260.220.
Heat rate (K/min) 5.2.2.2.2.
Initial hold (min) 10.3.3.3.
Final hold (min)  5.5.5.20.
I 1506.1492.1509.1492.1500.
ReferenceCioni, Flamini, et al., 2005Dob, Berramdane, et al., 2005Dob, Berramdane, et al., 2005, 2Dob T., Berramdane T., et al., 2005Ferrari, Tomi, et al., 2005
Comment MSDC-RI MSDC-RI MSDC-RI MSDC-RI MSDC-RI
Column type CapillaryCapillaryCapillaryCapillaryCapillary
Active phase HP-5HP-5DB-1DB-1RTX-1
Column length (m) 30.30.25.30.60.
Carrier gas N2N2 N2He
Substrate
Column diameter (mm) 0.250.250.250.250.22
Phase thickness (μm) 0.250.250.250.250.25
Tstart (C) 60.60.60.50.60.
Tend (C) 220.220.180.200.230.
Heat rate (K/min) 5.5.3.5.2.
Initial hold (min) 10.10.10.
Final hold (min)   10. 35.
I 1509.1507.1505.1511.1500.
ReferenceFlamini, Luigi Cioni, et al., 2005Flamini, Luigi Cioni, et al., 2005, 2bin Jantan, Yalvema, et al., 2005Menut, Cabalion, et al., 2005Paolini, Costa, et al., 2005
Comment MSDC-RI MSDC-RI MSDC-RI MSDC-RI MSDC-RI
Column type CapillaryCapillaryCapillaryCapillaryCapillary
Active phase HP-5MSHP-5MSDB-1Mega 5MSHP-5MS
Column length (m) 30.60.30.30.30.
Carrier gas HeHeN2HeHe
Substrate
Column diameter (mm) 0.250.20.250.250.25
Phase thickness (μm) 0.250.250.250.250.25
Tstart (C) 60.60.50.40.60.
Tend (C) 250.200.200.240.280.
Heat rate (K/min) 4.2.5.3.3.
Initial hold (min) 2.  2.
Final hold (min) 20.10.
I 1509.1501.1500.1500.1505.
ReferencePino, Mesa, et al., 2005Smadja, Rondeau, et al., 2005Tchoumbougnang, Zollo, et al., 2005Verzera, Trozzi, et al., 2005Aligiannis, Kalpoutzakis, et al., 2004
Comment MSDC-RI MSDC-RI MSDC-RI MSDC-RI MSDC-RI
Column type CapillaryCapillaryCapillaryCapillaryCapillary
Active phase SPB-1HP-5HP-5MSRTX-5HP-1
Column length (m) 30.30.30.30.25.
Carrier gas HeN2HeHeHe
Substrate
Column diameter (mm) 0.250.250.250.250.32
Phase thickness (μm) 0.250.250.250.250.17
Tstart (C) 70.60.60.45.50.
Tend (C) 220.220.280.300.200.
Heat rate (K/min) 3.5.3.3.3.
Initial hold (min)  10. 6.
Final hold (min) 15.  10.
I 1497.1508.1508.1510.1479.
ReferenceAntunes, Sevinate-Pinto, et al., 2004Bertoli, Pistelli, et al., 2004Chorianopoulos, Kalpoutzakis, et al., 2004Dugo, Mondello, et al., 2004Fernández-Ocaña, Gómez-Rodríguez, et al., 2004
Comment MSDC-RI MSDC-RI MSDC-RI MSDC-RI MSDC-RI
Column type CapillaryCapillaryCapillaryCapillaryCapillary
Active phase DB-5BP-1HP-5DB-5MSRSL-200
Column length (m) 30.50.30.30.30.
Carrier gas N2 HeHeH2
Substrate
Column diameter (mm) 0.250.220.250.250.32
Phase thickness (μm) 0.250.25 0.250.25
Tstart (C) 60.60.60.40.40.
Tend (C) 240.220.260.280.280.
Heat rate (K/min) 3.2.3.4.6.
Initial hold (min)    2.5.
Final hold (min)  20.  5.
I 1508.1502.1508.1515.1521.
ReferenceFlamini, Cioni, et al., 2004Gonny, Bradesi, et al., 2004Javidnia, Miri, et al., 2004Mardarowicz, Wianowska, et al., 2004Ngassoum, Ousmaila, et al., 2004
Comment MSDC-RI MSDC-RI MSDC-RI MSDC-RI MSDC-RI
Column type CapillaryCapillaryCapillaryCapillaryCapillary
Active phase Methyl SiliconeHP-5HP-5HP-5MSDB-5
Column length (m) 50.25.50.30.25.
Carrier gas HeHeHeHeN2
Substrate
Column diameter (mm) 0.250.20.20.250.25
Phase thickness (μm)  0.330.20.250.25
Tstart (C) 50.60.35.60.75.
Tend (C) 240.240.250.280.210.
Heat rate (K/min) 3.3.3.3.3.
Initial hold (min)   15. 10.
Final hold (min)  7.40. 1.
I 1509.1508.1509.1488.1510.
ReferenceÖzcan and Chalchat, 2004Sartoratto, Machado, et al., 2004Stashenko, Jaramillo, et al., 2004Tzakou, Vagias, et al., 2004bin Ahmad and bin Jantan, 2003
Comment MSDC-RI MSDC-RI MSDC-RI MSDC-RI MSDC-RI
Column type CapillaryCapillaryCapillaryCapillaryCapillary
Active phase BPX-5DB-5DB-5BP-1HP-5
Column length (m) 30.30.30.50.30.
Carrier gas N2HeHeHeHe
Substrate
Column diameter (mm) 0.250.250.250.220.25
Phase thickness (μm) 0.250.250.250.250.25
Tstart (C) 75.60.60.60.60.
Tend (C) 210.240.240.230.280.
Heat rate (K/min) 3.3.3.2.3.
Initial hold (min) 10.
Final hold (min) 1.30. 35.
I 1510.1509.1510.1504.1504.
Referencebin Ahmad and bin Jantan, 2003, 2Bader, Caponi, et al., 2003Bader, Flamini, et al., 2003Bianchini, Tomi, et al., 2003Bougatsos, Meyer, et al., 2003
Comment MSDC-RI MSDC-RI MSDC-RI MSDC-RI MSDC-RI
Column type CapillaryCapillaryCapillaryCapillaryCapillary
Active phase SPB-1RTX-1Ultra-2Optima 5HP-5
Column length (m) 30.60.25.25.30.
Carrier gas HeHeH2HeN2
Substrate
Column diameter (mm) 0.20.220.250.250.25
Phase thickness (μm) 0.20.250.330.250.25
Tstart (C) 70.60.40.60.60.
Tend (C) 220.230.280.280.220.
Heat rate (K/min) 3.2.3.3.5.
Initial hold (min)   2. 10.
Final hold (min) 15.45.10.20.
I 1497.1502.1508.1500.1507.
ReferenceCavaleiro, Salgueiro, et al., 2003Cavalli, Tomi, et al., 2003Ceva-Antunes, Bizzo, et al., 2003Chosson, Vérité, et al., 2003Dural, Bagci, et al., 2003
Comment MSDC-RI MSDC-RI MSDC-RI MSDC-RI MSDC-RI
Column type CapillaryCapillaryCapillaryCapillaryCapillary
Active phase HP-5DB-1DB-1PE-5DB-5
Column length (m) 30.30.30.30.30.
Carrier gas N2HeHeHeN2
Substrate
Column diameter (mm) 0.250.250.250.250.25
Phase thickness (μm) 0.250.250.25 0.25
Tstart (C) 60.40.40.40.75.
Tend (C) 220.250.250.280.230.
Heat rate (K/min) 5.2.2.3.3.
Initial hold (min) 10.5.5. 10.
Final hold (min)  20.
I 1509.1491.1495.1511.1505.
ReferenceErtugrul, Dural, et al., 2003de Feo, Bruno, et al., 2003de Feo, Urrunaga Soria, et al., 2003Isidorov and Vinogorova, 2003bin Jantan, Yassin, et al., 2003
Comment MSDC-RI MSDC-RI MSDC-RI MSDC-RI MSDC-RI
Column type CapillaryCapillaryCapillaryCapillaryCapillary
Active phase DB-5HP-5HP-5MSBPX-5HP-5
Column length (m) 25.30.30.30.30.
Carrier gas HeHeHeHeHe
Substrate
Column diameter (mm) 0.250.250.250.250.25
Phase thickness (μm)  0.250.250.250.25
Tstart (C) 60.60.50.60.60.
Tend (C) 260.240.250.240.280.
Heat rate (K/min) 4.3.3.3.4.
Initial hold (min)    2.5.
Final hold (min)
I 1510.1509.1508.1513.1506.
ReferenceJavidnia, Miri, et al., 2003Macchioni, Cioni, et al., 2003Salido, Altarejos, et al., 2003Shellie, Marriott, et al., 2003Skaltsa, Demetzos, et al., 2003
Comment MSDC-RI MSDC-RI MSDC-RI MSDC-RI MSDC-RI
Column type CapillaryCapillaryCapillaryCapillaryCapillary
Active phase HP-5Mega 5MSSPB-1DB-5DB-5
Column length (m) 30.30.30.30.30.
Carrier gas HeHeHe He
Substrate
Column diameter (mm) 0.250.250.200.250.25
Phase thickness (μm) 0.250.250.200.250.25
Tstart (C) 60.40.70.50.60.
Tend (C) 280.240.220.280.240.
Heat rate (K/min) 3.3.3.3.3.
Initial hold (min)  2. 5.
Final hold (min)   15.
I 1508.1500.1507.1509.1512.
ReferenceTzakou, Couladis, et al., 2003Verzera, Trozzi, et al., 2003Cavaleiro, Salgueiro, et al., 2002Economakis, Skaltsa, et al., 2002Flamini, Cioni, et al., 2002
Comment MSDC-RI MSDC-RI MSDC-RI MSDC-RI MSDC-RI
Column type CapillaryCapillaryCapillaryCapillaryCapillary
Active phase DB-1BP-1DB-5RTX-5SPB-5
Column length (m) 25.50.25.30.30.
Carrier gas N2HeHeHeHe
Substrate
Column diameter (mm) 0.250.220.250.250.25
Phase thickness (μm)  0.25 0.250.25
Tstart (C) 60.60.70.45.60.
Tend (C) 180.220.260.300.250.
Heat rate (K/min) 3.2.4.3.4.
Initial hold (min) 10.  6.2.
Final hold (min) 10.20. 10.20.
I 1498.1500.1509.1518.1509.
Referencebin Jantan and bin Ahmad, 2002Lota, de Rocca Serra, et al., 2002Miri, Ramezani, et al., 2002Mondello, Zappia, et al., 2002Pino, Marbot, et al., 2002
Comment MSDC-RI MSDC-RI MSDC-RI MSDC-RI MSDC-RI
Column type CapillaryCapillaryCapillaryCapillaryCapillary
Active phase CP Sil 5 CBHP-5MSHP-5HP-5BP-1
Column length (m) 50.30.30.30.50.
Carrier gas HeHeHeHeHe
Substrate
Column diameter (mm) 0.320.250.250.250.22
Phase thickness (μm) 0.40.250.250.250.25
Tstart (C) 60.50.60.60.60.
Tend (C) 280.250.280.280.220.
Heat rate (K/min) 3.5.3.3.2.
Initial hold (min) 10.2.5.5.
Final hold (min) 60.5.
I 1505.1509.1508.1506.1500.
ReferencePino, Marbot, et al., 2002, 2Shang, Hu, et al., 2002Aligiannis, Kalpoutzakis, et al., 2001Aligiannis, Kalpoutzakis, et al., 2001, 2Lota, Serra, et al., 2001
Comment MSDC-RI MSDC-RI MSDC-RI MSDC-RI MSDC-RI
Column type CapillaryCapillaryCapillaryCapillaryCapillary
Active phase DB-5CP Sil 5 CBHP-5DB-5DB-5
Column length (m) 30.50.30.60.30.
Carrier gas H2HeHeHeHe
Substrate
Column diameter (mm) 0.250.320.200.250.25
Phase thickness (μm) 0.250.40.250.250.25
Tstart (C) 60.60.60.40.60.
Tend (C) 240.280.180.290.240.
Heat rate (K/min) 3.3.4.4.3.
Initial hold (min)  10.8.2.2.
Final hold (min)  60.2.5.
I 1508.1505.1509.1502.1510.
ReferenceNogueira, Bittrich, et al., 2001Pino, Marbot, et al., 2001Alonzo, Bosco, et al., 2000Bartley and Jacobs, 2000Maia, de Paula, et al., 2000
Comment MSDC-RI MSDC-RI MSDC-RI MSDC-RI MSDC-RI
Column type CapillaryCapillaryCapillaryCapillaryCapillary
Active phase RTX-5Mega 5MSCP Sil 8 CBHP-5BP-1
Column length (m) 10.30.50.30.50.
Carrier gas HeHe HeHe
Substrate
Column diameter (mm) 0.10.250.320.250.22
Phase thickness (μm) 0.10.25 0.250.25
Tstart (C) 50.40.60.50.60.
Tend (C) 350.240.220.280.230.
Heat rate (K/min) 12.33.4.4.2.
Initial hold (min)  2.5.5.
Final hold (min)   30. 35.
I 1517.1500.1512.1506.1500.
ReferenceMondello, Zappia, et al., 2000Verzera, la Rosa, et al., 2000Chevance and Farmer, 1999Lazari, Skaltsa, et al., 1999Lota, Serra, et al., 1999
Comment MSDC-RI MSDC-RI MSDC-RI MSDC-RI MSDC-RI
Column type CapillaryCapillaryCapillaryCapillaryCapillary
Active phase BP-1BP-1Methyl SiliconeUltra-1OV-1
Column length (m) 50.50.50.25.25.
Carrier gas HeHeN2HeH2
Substrate
Column diameter (mm) 0.220.220.250.320.25
Phase thickness (μm) 0.250.250.170.520.3
Tstart (C) 60.60.80.35.50.
Tend (C) 230.220.200.320.200.
Heat rate (K/min) 2.2.2.15.3.
Initial hold (min)     1.
Final hold (min) 35.20. 10.20.
I 1500.1500.1508.1504.1495.
ReferenceLota, Serra, et al., 1999Mazzoni, Tomi, et al., 1999Sumathykutty, Rao, et al., 1999Richmond and Pombo-Villar, 1998Bicchi, Fresia, et al., 1997
Comment MSDC-RI MSDC-RI MSDC-RI MSDC-RI MSDC-RI
Column type CapillaryCapillaryCapillaryCapillaryCapillary
Active phase BP-1Ultra-1DB-1DB-1DB-1
Column length (m) 50.25.30.60.60.
Carrier gas He He He
Substrate
Column diameter (mm) 0.220.320.200.320.25
Phase thickness (μm) 0.250.520.200.50.25
Tstart (C) 60.35.70.40.70.
Tend (C) 230.320.200.290.250.
Heat rate (K/min) 2.15.4.4.2.5
Initial hold (min)   5.2.5.
Final hold (min) 35.10. 5.15.
I 1501.1503.991498.1501.1495.
ReferenceMariotti, Costa, et al., 1997Richmond and Pombo-Villar, 1997Stashenko, Wiame, et al., 1995Bartley and Foley, 1994Combariza, Tirado, et al., 1994
Comment MSDC-RI MSDC-RI MSDC-RI MSDC-RI MSDC-RI
Column type CapillaryCapillaryCapillaryCapillaryCapillary
Active phase HP-101OV-101OV-101OV-1OV-1
Column length (m) 50.50.50.30.30.
Carrier gas N2N2N2HeHe
Substrate
Column diameter (mm) 0.250.250.250.50.5
Phase thickness (μm)    0.80.8
Tstart (C) 70.80.80.40.40.
Tend (C) 200.200.200.220.220.
Heat rate (K/min) 3.2.2.2.2.
Initial hold (min)
Final hold (min)
I 1513.1503.1505.1493.1503.
ReferenceChung, Eiserich, et al., 1993Yang, Sugisawa, et al., 1992Yang, Sugisawa, et al., 1992De Pooter, Omar, et al., 1985De Pooter, Omar, et al., 1985
Comment MSDC-RI MSDC-RI MSDC-RI MSDC-RI MSDC-RI

Van Den Dool and Kratz RI, non-polar column, custom temperature program

Data compiled by: NIST Mass Spectrometry Data Center, William E. Wallace, director

Column type CapillaryCapillaryCapillaryCapillaryCapillary
Active phase HP-5MSDB-5BP-5DB-5BPX-5
Column length (m) 30.30.25.30.30.
Carrier gas HeHeHe
Substrate
Column diameter (mm) 0.250.250.220.250.25
Phase thickness (μm) 0.250.250.250.250.25
Program 60C (1 min) => 5 C/min => 210C => 10 C/min => 280C (15 min)40C(2min) => 4C/min => 220C => 20C/min => 280C30C(1min) => 50C/min => 105C => 1.5C/min => 150C => 30C/min => 280C (10min)40C(5min) => 2C/min => 250C(15min) => 10C/min => 270C35C(5min) => 3C/min => 210C => 40C/min => 240C (4min)
I 1514.41509.1507.1507.1520.
ReferenceAndriamaharavo, 2014Andrade, Sampaio, et al., 2007Sant'Anna, Fontes, et al., 2007Basile, Senatore, et al., 2006Cardeal, da Silva, et al., 2006
Comment MSDC-RI MSDC-RI MSDC-RI MSDC-RI MSDC-RI
Column type CapillaryCapillaryCapillaryCapillaryCapillary
Active phase DB-5DB-15 % Phenyl methyl siloxaneSE-52CP Sil 8 CB
Column length (m) 30.30.30.25.50.
Carrier gas HeHeHeHeHe
Substrate
Column diameter (mm) 0.320.250.320.250.32
Phase thickness (μm) 0.250.250.150.25
Program 40C(3min) => 3C/min => 180C => 10C/min => 260C(2min)35C => 2C/min => 200C => 5C/min => 240C45C => 1C/min => 100C => 5C/min => 250C (10min)60C(8min) => 3C/min => 180C => 20C/min => 230C60C (2min) => 5C/min => 160C (1min) => 10C/min => 250C (2min)
I 1505.1486.1513.1506.1509.
ReferenceMoon, Cliff, et al., 2006Suliman F.E.O., Fatope M.O., et al., 2006Sacchetti, Maietti, et al., 2005Lorenzo, Loayza, et al., 2003Mockute and Judzentiene, 2003
Comment MSDC-RI MSDC-RI MSDC-RI MSDC-RI MSDC-RI
Column type CapillaryCapillaryCapillaryCapillary
Active phase DB-5DB-5BPX-5SE-52
Column length (m) 30.30.50.60.
Carrier gas H2H2HeHe
Substrate
Column diameter (mm) 0.250.250.320.32
Phase thickness (μm) 0.250.250.50.40
Program 40C(5min) => 2C/min => 220C => 5C/min => 250C(15min)40C(5min) => 2C/min => 220C => 5C/min => 250C(15min)0C (5min) => 40C/min => 40C (2min) => 10C/min => 280C45 C (6 min) 3 C/min -> 111 0C 2 C/min -> 160 C 3 C/min -> 300 C (15 min)
I 1482.1482.1536.1515.
ReferenceBoulanger, Chassagne, et al., 1999Boulanger, Chassagne, et al., 1999Elmore, Erbahadir, et al., 1997Mondello, Dugo, et al., 1995
Comment MSDC-RI MSDC-RI MSDC-RI MSDC-RI

Kovats' RI, non-polar column, custom temperature program

Data compiled by: NIST Mass Spectrometry Data Center, William E. Wallace, director

Column type CapillaryCapillaryCapillaryCapillary
Active phase BP-1BP-1BP-1HP-5
Column length (m) 25.25.30.30.
Carrier gas N2N2N2He
Substrate
Column diameter (mm) 0.250.250.320.25
Phase thickness (μm) 0.250.250.250.25
Program 60C => 5C/min => 220C(5min) => 3C/min => 245C(5min)60C => 5C/min => 220C (5min) => 3C/min => 245 C (5min)60 C 5 C/min -> 220 C (5 min) 3 C/min -> 245 C (5 min)50 0C 5 K/min -> 140 0C 2 K/min -> 170 0C
I 1506.1505.1505.1509.
ReferenceDwivedi, Khan, et al., 2004Khan, Srivastava, et al., 2003Khan, Srivastava, et al., 2002Novak, Zitterl-Eglseer, et al., 2001
Comment MSDC-RI MSDC-RI MSDC-RI MSDC-RI

Kovats' RI, polar column, isothermal

Data compiled by: NIST Mass Spectrometry Data Center, William E. Wallace, director

Column type PackedPackedPackedPacked
Active phase Carbowax 20MCarbowax 20MCarbowax 20MCarbowax 20M
Column length (m) 7.37.3
Carrier gas
Substrate
Column diameter (mm)  3.17
Phase thickness (μm)
Temperature (C) 150.165.132.165.
I 1731.1746.1726.1746.
ReferenceAndersen, Bissonette, et al., 1977Ohta, Andersen, et al., 1977Andersen and Falcone, 1969Andersen and Falcone, 1969
Comment MSDC-RI MSDC-RI MSDC-RI MSDC-RI

References

Allegrone, Belliardo, et al., 2006
Allegrone, G.; Belliardo, F.; Cabella, P., Comparison of volatile concentrations in hand-squeezed juices of four different lemon varieties, J. Agric. Food Chem., 2006, 54, 5, 1844-1848, https://doi.org/10.1021/jf051206s . [all data]

Hazzit, Baaliouamer, et al., 2006
Hazzit, M.; Baaliouamer, A.; Faleiro, M.L.; Miguel, M.G., Composition of the Essential Oils of Thymus and Origanum Species from Algeria and Their Antioxidant and Antimicrobial Activities, J. Agric. Food Chem., 2006, 54, 17, 6314-6321, https://doi.org/10.1021/jf0606104 . [all data]

Lucero, Fredrickson, et al., 2006
Lucero, M.E.; Fredrickson, E.L.; Estell, R.E.; Morrison, A.A.; Richman, D.B., Volatile Composition of Gutierrezia sarothrae (Broom Snakeweed) as Determined by Steam Distillation and Solid Phase Microextraction, J. Essent. Oil Res., 2006, 18, 2, 121-125, https://doi.org/10.1080/10412905.2006.9699039 . [all data]

Srivastava, Srivastava, et al., 2006
Srivastava, A.K.; Srivastava, S.K.; Syamsundar, K.V., Volatile composition of Curcuma angustifolia Roxb. rhizome from central and southern India, Flavour Fragr. J., 2006, 21, 3, 423-426, https://doi.org/10.1002/ffj.1680 . [all data]

Sylvestre, Pichette, et al., 2006
Sylvestre, M.; Pichette, A.; Longtin, A.; Nagau, F.; Legault, J., Essential oil analysis and anticancer activity of leaf essential oil of Croton flavens L. from Guadeloupe, J. Ethnopharmacol., 2006, 103, 1, 99-102, https://doi.org/10.1016/j.jep.2005.07.011 . [all data]

Tepe, Askin Akpulat, et al., 2006
Tepe, B.; Askin Akpulat, H.; Sokmen, M.; Daferera, D.; Yumrutas, O.; Aydin, E.; Polissiou, M.; Sokmen, A., Screening of the antioxidative and antimicrobial properties of the essential oils of Pimpinella anisetum and Pimpinella flabellifolia from Turkey, Food Chem., 2006, 97, 4, 719-724, https://doi.org/10.1016/j.foodchem.2005.05.045 . [all data]

Asuming, Beauchamp, et al., 2005
Asuming, W.A.; Beauchamp, P.S.; Descalzo, J.T.; Dev, B.C.; Dev, V.; Frost, S.; Ma, C.W., Essential oil composition of four Lomatium Raf. species and their chemotaxonomy, Biochem. Syst. Ecol., 2005, 33, 1, 17-26, https://doi.org/10.1016/j.bse.2004.06.005 . [all data]

Shatar S., 2005
Shatar S., Essential oil of Ferula ferulaoides from Western Mongolia, Chem. Nat. Compd. (Engl. Transl.), 2005, 41, 5, 607-608, https://doi.org/10.1007/s10600-005-0222-8 . [all data]

Behera, Nagarajan, et al., 2004
Behera, S.; Nagarajan, S.; Rao, L.J.M., Microwave heating and conventional roasting of cumin seeds (Cuminum cyminum L.) and effect on chemical composition of volatiles, Food Chem., 2004, 87, 1, 25-29, https://doi.org/10.1016/j.foodchem.2003.10.012 . [all data]

Juliani, Zygadlo, et al., 2004
Juliani, H.R.; Zygadlo, J.A.; Scrivanti, R.; de la Sota, E.; Simon, J.E., The essential oil of Anemia tomentosa (Savigny) Sw. var. anthriscifolia (Schrad.) Mickel, Flavour Fragr. J., 2004, 19, 6, 541-543, https://doi.org/10.1002/ffj.1341 . [all data]

Lopes, Strobl, et al., 2004
Lopes, D.; Strobl, H.; Kolodziejczyk, P., 14-Methylpentadecano-15-lactone (Muscolide): a new macrocyclic lactone from the oil of Angelica archangelica L., Chemistry and Biodiversity, 2004, 1, 12, 1880-1887, https://doi.org/10.1002/cbdv.200490144 . [all data]

Amparo Blázquez, Pérez, et al., 2003
Amparo Blázquez, M.; Pérez, I.; Boira, H., Essential oil analysis of Teucrium libanitis and T. turredanum by GC and GC-MS, Flavour Fragr. J., 2003, 18, 6, 497-501, https://doi.org/10.1002/ffj.1256 . [all data]

Baranauskiene, Venskutonis, et al., 2003
Baranauskiene, R.; Venskutonis, R.P.; Demyttenaere, J.C.R., Sensory and instrumental evaluation of catnip (Nepeta cataria L.) aroma, J. Agric. Food Chem., 2003, 51, 13, 3840-3848, https://doi.org/10.1021/jf021187b . [all data]

Baranauskiene, Venskutonis, et al., 2003, 2
Baranauskiene, R.; Venskutonis, P.R.; Viskelis, P.; Dambrauskiene, E., Influence of nitrogen fertilizers on the yield and composition of thyme (Thymus vulgaris), J. Agric. Food Chem., 2003, 51, 26, 7751-7758, https://doi.org/10.1021/jf0303316 . [all data]

Gkinis, Tzakou, et al., 2003
Gkinis, G.; Tzakou, O.; Iliopoulou, D.; Roussis, V., Chemical Composition and Biological Activity of Nepeta parnassica Oils and Isolated Nepetalactones, Z. Naturforsch. C:, 2003, 58, 681-686. [all data]

Ogunwande, Olawore, et al., 2003
Ogunwande, I.A.; Olawore, N.O.; Adeleke, K.A.; Ekundayo, O.; Koenig, W.A., Chemical composition of the leaf volatile oil of Psidium guajava L. growing in Nigeria, Flavour Fragr. J., 2003, 18, 2, 136-138, https://doi.org/10.1002/ffj.1175 . [all data]

Raina, Srivastava, et al., 2003
Raina, V.K.; Srivastava, S.K.; Syamasunder, K.V., Essential oil composition of Acorus calamus L. from the lower region of the Himalayas, Flavour Fragr. J., 2003, 18, 1, 18-20, https://doi.org/10.1002/ffj.1136 . [all data]

Jayaprakasha, Jena, et al., 2002
Jayaprakasha, G.K.; Jena, B.S.; Negi, P.S.; Sakariah, K.K., Evaluation of antioxidant activities and antimutagenicity of turmeric oil: a byproduct from curcumin production, Z. Naturforsch. C:, 2002, 57c, 828-835, retrieved from http://www.znaturforsch.com/57c/s57c0828.pdf. [all data]

Juliani and Simon, 2002
Juliani, H.R.; Simon, J.E., Antioxidant acitivity of basil in Trends in new crops and new uses, Janick,J.; Whipkey,A., ed(s)., ASHA Press, Alexandria, Va, 2002, 575-579. [all data]

Mevy, Bessiere, et al., 2002
Mevy, J.P.; Bessiere, J.-M.; Dherbomez, M.; Viano, J., Composition and some biological activities of the essential oils from an African pasture grass: Elionurus elegans Kunth., J. Agric. Food Chem., 2002, 50, 15, 4240-4243, https://doi.org/10.1021/jf0115140 . [all data]

Raina, Srivastava, et al., 2002
Raina, V.K.; Srivastava, S.K.; Syamasunder, K.V., The essential oil of 'greater galangal' [Alpinia galanga (L.) Willd.] from the lower Himalayan region of India, Flavour Fragr. J., 2002, 17, 5, 358-360, https://doi.org/10.1002/ffj.1105 . [all data]

Raina, Srivastava, et al., 2002, 2
Raina, V.K.; Srivastava, S.K.; Jain, N.; Ahmad, A.; Syamasundar, K.V.; Aggarwal, K.K., Essential oil composition of Curcuma longa L. cv. Roma from the plains of northern India, Flavour Fragr. J., 2002, 17, 2, 99-102, https://doi.org/10.1002/ffj.1053 . [all data]

Salido, Altarejos, et al., 2002
Salido, S.; Altarejos, J.; Nogueras, M.; Sánchez, A.; Pannecouque, C.; Witvrouw, M.; De Clercq, E., Chemical studies of essential oils of Juniperus oxycedrus ssp. badia, J. Ethnopharmacol., 2002, 81, 1, 129-134, https://doi.org/10.1016/S0378-8741(02)00045-4 . [all data]

Shawl, Srivastava, et al., 2002
Shawl, A.S.; Srivastava, S.K.; Syamasundar, K.V.; Tripathi, S.; Raina, V.K., Essential oil composition of Achillea millefolium L. growing wild in Kashmir, India, Flavour Fragr. J., 2002, 17, 3, 165-168, https://doi.org/10.1002/ffj.1074 . [all data]

Rajeswara Rao, 2001
Rajeswara Rao, B.R., Biomass and essential oil yields of rainfed palmarosa (Cymbopogon martinii (Roxb.) Wats. var. motia Burk.) supplied with different levels of organic manure and fertilizer nitrogen in semi-arid tropical climate, Ind. Crops Prod., 2001, 14, 3, 171-178, https://doi.org/10.1016/S0926-6690(01)00081-4 . [all data]

Tzakou and Couladis, 2001
Tzakou, O.; Couladis, M., The essential oil of Micromeria graeca (L.) Bentham et Reichenb. growing in Greece, Flavour Fragr. J., 2001, 16, 2, 107-109, https://doi.org/10.1002/ffj.955 . [all data]

Adams, 2000
Adams, R.P., Systematics of the one seeded Juniperus of the eastern hemisphere based on leaf essential oils and random amplified polymorphic DNAs (RAPDs), Biochem. Syst. Ecol., 2000, 28, 6, 529-543, https://doi.org/10.1016/S0305-1978(99)00096-4 . [all data]

Adams, 1999
Adams, R.P., Systematics of multi-seeded eastern hemisphere Juniperus based on leaf essential oils and RAPD DNA fingerprinting, Biochem. Syst. Ecol., 1999, 27, 7, 709-725, https://doi.org/10.1016/S0305-1978(99)00016-2 . [all data]

Jantan I. and Ahmad A.S., 1999
Jantan I.; Ahmad A.S., Oleoresins of three pinus species from malaysian pine plantations, ASEAN Review of BiodiversityEnvironment Conservation, 1999, November-December, 1-9. [all data]

Kuiate, Zollo, et al., 1999
Kuiate, J.-R.; Zollo, P.-H.A.; Lamaty, G.; Menut, C.; Bessière, J.-M., Composition of the essential oils from the leaves of two varieties of Aspilia africana (Pers.) C. D. Adams from Cameroon, Flavour Fragr. J., 1999, 14, 3, 167-169, https://doi.org/10.1002/(SICI)1099-1026(199905/06)14:3<167::AID-FFJ802>3.0.CO;2-O . [all data]

Sajjadi and Ghassemi, 1999
Sajjadi, S.E.; Ghassemi, N., Volatile constituents of Nepeta glomerulosa Boiss. subsp. carmanica, Flavour Fragr. J., 1999, 14, 5, 265-267, https://doi.org/10.1002/(SICI)1099-1026(199909/10)14:5<265::AID-FFJ822>3.0.CO;2-A . [all data]

Siani, Ramos, et al., 1999
Siani, A.C.; Ramos, M.F.S.; Menezes-de-Lima, O., Jr.; Ribeiro-dos-Santos, R.; Fernadez-Ferreira, E.; Soares, R.O.A.; Rosas, E.C.; Susunaga, G.S.; Guimarães, A.C.; Zoghbi, M.G.B.; Henriques, M.G.M.O., Evaluation of anti-inflammatory-related activity of essential oils from the leaves and resin of species of Protium, J. Ethnopharmacol., 1999, 66, 1, 57-69, https://doi.org/10.1016/S0378-8741(98)00148-2 . [all data]

Adegoke, Rao, et al., 1998
Adegoke, G.O.; Rao, L.J.M.; Shankaracharya, N.B., A comparison of the essential oils of Aframomum daniellii (Hook. f.) K. Schum. and Amomum subulatum Roxb, Flavour Fragr. J., 1998, 13, 5, 349-352, https://doi.org/10.1002/(SICI)1099-1026(1998090)13:5<349::AID-FFJ758>3.0.CO;2-O . [all data]

Mallavarapu, Rao, et al., 1998
Mallavarapu, G.R.; Rao, B.R.R.; Kaul, P.N.; Ramesh, S.; Bhattacharya, A.K., Volatile constituents of the essential oils of the seeds and the herb of palmarosa (Cymbopogon martinii (Roxb.) Wats. var. motia Burk.), Flavour Fragr. J., 1998, 13, 3, 167-169, https://doi.org/10.1002/(SICI)1099-1026(199805/06)13:3<167::AID-FFJ719>3.0.CO;2-B . [all data]

Szafranek, Malinski, et al., 1998
Szafranek, B.; Malinski, E.; Szafranek, J., The sesquiterpene composition of leaf cuticular neutral lipids of ten varieties of polish Solanum tuberosum, J. Sci. Food Agric., 1998, 76, 4, 588-592, https://doi.org/10.1002/(SICI)1097-0010(199804)76:4<588::AID-JSFA994>3.0.CO;2-M . [all data]

Jantan, Ahmad, et al., 1996
Jantan, I.; Ahmad, A.S.; Ahmad, A.R.; Ali, N.A.M.; Ayop, N., Chemical composition of some citrus oils from Malaysia, J. Essent. Oil Res., 1996, 8, 6, 627-632, https://doi.org/10.1080/10412905.1996.9701030 . [all data]

Saad, El-Sharkawy, et al., 1995
Saad, H.-E.A.; El-Sharkawy, S.H.; Halim, A.F., Essential oils of Daucus carota ssp. maximus, Pharm. Acta Helv., 1995, 70, 1, 79-84, https://doi.org/10.1016/0031-6865(94)00054-Y . [all data]

Ekundayo, Laakso, et al., 1988
Ekundayo, O.; Laakso, I.; Adegbola, R.-M.; Oguntimein, B.; Sofowora, A.; Hiltunen, R., Essential oil constituents of Ashanti pepper (Piper guineense) fruits (berries), J. Agric. Food Chem., 1988, 36, 5, 880-882, https://doi.org/10.1021/jf00083a001 . [all data]