1,3-Cyclohexadiene, 5-(1,5-dimethyl-4-hexenyl)-2-methyl-, [S-(R*,S*)]-

Normal alkane RI, polar column, custom temperature program

Data compiled by: NIST Mass Spectrometry Data Center, William E. Wallace, director

Column type CapillaryCapillaryCapillaryCapillaryCapillary
Active phase HP-InnowaxSupelcowax-10HP-Innowax FSCHP-Innowax FSCHP-Innowax FSC
Column length (m) 30.30.60.60.60.
Carrier gas HeliumHeHeHe
Substrate
Column diameter (mm) 0.320.250.250.250.25
Phase thickness (μm) 0.500.250.250.250.25
Program 50 0C (5 min) 3 0C/min -> 210 0C (10 min) 3 0C/min -> 230 0C40C(3min) => 4C/min => 75C => 8C/min => 250C(5min)60C(10min) => 4C/min => 220C (10min) => 1C/min => 240C60(10min) => 4C/min => 220C(10min) => 1C/min => 240C60C(10min) => 4C/min => 220C (10min) => 1C/min => 240C
I 1681.1735.1726.1726.1725.
ReferenceSun, Hua, et al., 2010Vichi, Guadayol, et al., 2007Kürkçüoglu, Hüsnü Can Baser, et al., 2006Suleimenov Y.M., Atazhanova G.A., et al., 2006Tabanca, Demirci, et al., 2006
Comment MSDC-RI MSDC-RI MSDC-RI MSDC-RI MSDC-RI
Column type CapillaryCapillaryCapillaryCapillaryCapillary
Active phase Supelcowax-10HP-InnowaxHP-Innowax FSCCarbowax 20MCarbowax 20M
Column length (m) 30.60.60.
Carrier gas HeN2He
Substrate
Column diameter (mm) 0.250.250.25
Phase thickness (μm) 0.250.250.25
Program 40C(3min) => 4C/min => 75C => 8C/min => 260C(5min)60C(10min) => 4C/min => 220C(10min) => 1C/min => 240C60C(10min) => 4C/min => 220C(10min) => 1C/min => 240Cnot specifiednot specified
I 1732.1726.1725.1733.1738.
ReferenceVichi, Guadayol, et al., 2006Duman, Kartal, et al., 2005Tabanca, Demirci, et al., 2005Vinogradov, 2004Vinogradov, 2004
Comment MSDC-RI MSDC-RI MSDC-RI MSDC-RI MSDC-RI
Column type CapillaryCapillary
Active phase Innowax FSCInnowax FSC
Column length (m) 60.60.
Carrier gas HeHe
Substrate
Column diameter (mm) 0.250.25
Phase thickness (μm) 0.250.25
Program 60C(10min) => 4C/min => 220C(10min) => 1C/min => 240C60C(10 min) => 4C/min => 220C(10min) => 1C/min => 240C
I 1726.1726.
ReferenceBaser, Demirei, et al., 2002Kirimer, Tabanca, et al., 2000
Comment MSDC-RI MSDC-RI

Normal alkane RI, non-polar column, temperature ramp

Data compiled by: NIST Mass Spectrometry Data Center, William E. Wallace, director

Column type CapillaryCapillaryCapillaryCapillaryCapillary
Active phase Polydimethyl siloxane with 5 % PhHP-5HP-5 MSHP-5RTX-1
Column length (m) 30.30.30.30.60.
Carrier gas HeliumHeliumHeliumHeliumHelium
Substrate
Column diameter (mm)  0.320.250.2520.22
Phase thickness (μm)  0.250.250.250.25
Tstart (C) 80.60.40.60.60.
Tend (C) 200.240.260.240.230.
Heat rate (K/min) 5.3.4.3.2.
Initial hold (min)  2.
Final hold (min) 25. 5. 30.
I 1490.1495.1497.1503.1489.
ReferencePriya, Prathapan, et al., 2012Kahriman, Tosun, et al., 2011Miyazawa, Marumoto, et al., 2011Cavar, Maksimovic, et al., 2010Dib, Djabou, et al., 2010
Comment MSDC-RI MSDC-RI MSDC-RI MSDC-RI MSDC-RI
Column type CapillaryCapillaryCapillaryCapillaryCapillary
Active phase HP-5 MSDB-1HP-5HP-5 MSHP-5
Column length (m) 30.25.30.30.30.
Carrier gas HeliumNitrogenHeliumHeliumHydrogen
Substrate
Column diameter (mm) 0.250.250.250.250.25
Phase thickness (μm) 0.250.250.250.250.25
Tstart (C) 70.60.40.70.70.
Tend (C) 290.250.260.290.290.
Heat rate (K/min) 5.4.4.5.5.
Initial hold (min)  1.
Final hold (min)  10.5.10.
I 1500.1489.1499.1497.1502.
ReferenceLazarevic, Radulovic, et al., 2010Mirjalili, Salehi, et al., 2010Miyazawa, Kawauchi, et al., 2010Radulovic, Blagojevic, et al., 2010Radulovic, Dordevic, et al., 2010
Comment MSDC-RI MSDC-RI MSDC-RI MSDC-RI MSDC-RI
Column type CapillaryCapillaryCapillaryCapillaryCapillary
Active phase OV-101OV-101ZB-5HP-5RTX-1
Column length (m) 50.50.30.25.60.
Carrier gas HeliumHeliumHeliumHeliumHelium
Substrate
Column diameter (mm) 0.250.250.250.200.22
Phase thickness (μm) 0.250.250.250.330.25
Tstart (C) 70.70.50.60.60.
Tend (C) 220.220.240.240.230.
Heat rate (K/min) 2.2.3.3.2.
Initial hold (min)
Final hold (min)   1.7.30.
I 1494.1500.1447.1506.1489.
ReferenceBenites, Moiteiro, et al., 2009Benites, Moiteiro, et al., 2009Gardini, Beletti, et al., 2009Maridass, 2009Museli, Pau, et al., 2009
Comment MSDC-RI MSDC-RI MSDC-RI MSDC-RI MSDC-RI
Column type CapillaryCapillaryCapillaryCapillaryCapillary
Active phase RTX-1RTX-1HP-5HP-5MSCol-Elite 5MS
Column length (m) 60.60.30.30.30.
Carrier gas HeliumHeHeliumHeHe
Substrate
Column diameter (mm) 0.220.220.250.250.25
Phase thickness (μm) 0.250.250.320.250.25
Tstart (C) 60.60.60.60.30.
Tend (C) 230.230.250.240.246.
Heat rate (K/min) 2.2.5.3.3.
Initial hold (min)   30.
Final hold (min) 30.35.
I 1489.1488.1495.1508.1504.
ReferenceMuseli, Pau, et al., 2009Paolini, Tomi, et al., 2008Yassa and Akhani, 2008Argyropoulou, Daferera, et al., 2007Gudaityte and Venskutonis R.P., 2007
Comment MSDC-RI MSDC-RI MSDC-RI MSDC-RI MSDC-RI
Column type CapillaryCapillaryCapillaryCapillaryCapillary
Active phase AT-5DB-5DB-5SPB-5HP-5
Column length (m) 60.30.30.30.30.
Carrier gas HeliumHeHydrogenHeHe
Substrate
Column diameter (mm) 0.250.250.250.250.25
Phase thickness (μm) 0.250.250.250.250.32
Tstart (C) 60.60.50.50.60.
Tend (C) 260.240.250.250.250.
Heat rate (K/min) 4.2.4.2.5.
Initial hold (min)     30.
Final hold (min)
I 1500.1489.1490.1490.1495.
ReferenceMeccia, Rojas, et al., 2007Miyazawa and Tamura, 2007Pontes, de Olivera, et al., 2007Raal, Orav, et al., 2007Yassa and Akhani, 2007
Comment MSDC-RI MSDC-RI MSDC-RI MSDC-RI MSDC-RI
Column type CapillaryCapillaryCapillaryCapillaryCapillary
Active phase DB-5DB-5HP-5HP-5MSRTX-1
Column length (m) 30.30.30.30.30.
Carrier gas He HeHeHe
Substrate
Column diameter (mm) 0.250.250.250.250.32
Phase thickness (μm) 0.250.250.250.250.25
Tstart (C) 50.40.60.60.60.
Tend (C) 265.210.240.260.300.
Heat rate (K/min) 2.52.4.4.4.
Initial hold (min) 1.2.
Final hold (min) 20.33.
I 1497.1500.1494.1492.1488.
ReferenceBazargani, Almasirad, et al., 2006Garneau F.X., Collin G., et al., 2006Ibañez and Usubillaga, 2006Ibanez and Usubillaga, 2006Kula, Izydorczyk, et al., 2006
Comment MSDC-RI MSDC-RI MSDC-RI MSDC-RI MSDC-RI
Column type CapillaryCapillaryCapillaryCapillaryCapillary
Active phase DB-5MSDB-1DB-5DB-5DB-1
Column length (m) 30.50.30.30.50.
Carrier gas HeN2HeHeN2
Substrate
Column diameter (mm) 0.250.250.250.250.25
Phase thickness (μm) 0.250.250.250.250.25
Tstart (C) 60.95.60.40.90.
Tend (C) 280.240.200.250.240.
Heat rate (K/min) 3.4.2.4.4.
Initial hold (min)    2.
Final hold (min) 30. 60.10.
I 1484.1501.1497.1513.1469.
ReferenceMaronigiu, Piras, et al., 2006Pala-Paul J., Perez-Alonso M.J., et al., 2006Rout, Naik, et al., 2006Shen X., Gao Y., et al., 2006Velasco-Negueruela, Pérez-Alonso, et al., 2006
Comment MSDC-RI MSDC-RI MSDC-RI MSDC-RI MSDC-RI
Column type CapillaryCapillaryCapillaryCapillaryCapillary
Active phase BPX-5CP Sil 5 CBHP-5MSHP-5DB-1
Column length (m) 50.25.30.30.50.
Carrier gas   HeHeliumN2
Substrate
Column diameter (mm) 0.220.250.250.320.25
Phase thickness (μm) 1.0.150.250.250.25
Tstart (C) 70.50.60.40.90.
Tend (C) 280.230.280.300.240.
Heat rate (K/min) 4.3.4.4.4.
Initial hold (min)
Final hold (min) 4.  5.
I 1521.1486.1492.1485.1469.
ReferenceWohlmuth, Smith, et al., 2006Olawore, Ogunwande, et al., 2005Sajjadi, 2005Utsunomia, Kawata, et al., 2005Velasco-Negueruela, Pérez-Alonso, et al., 2005
Comment MSDC-RI MSDC-RI MSDC-RI MSDC-RI MSDC-RI
Column type CapillaryCapillaryCapillaryCapillaryCapillary
Active phase SPB-1DB-5NB-30NB-30DB-5
Column length (m) 50.30.50.50.30.
Carrier gas HeHeHeHeHe
Substrate
Column diameter (mm) 0.20.250.20.20.25
Phase thickness (μm) 0.330.250.250.250.25
Tstart (C) 50.60.50.50.40.
Tend (C) 220.300.250.250.250.
Heat rate (K/min) 4.3.2.2.2.
Initial hold (min) 3.   5.
Final hold (min) 30.   20.
I 1494.1489.1488.1488.1496.
ReferenceWong, Lee, et al., 2005Limberger, Sobral, et al., 2004Orav, Stulova, et al., 2004Orav, Stulova, et al., 2004Senatore, Rigano, et al., 2004
Comment MSDC-RI MSDC-RI MSDC-RI MSDC-RI MSDC-RI
Column type CapillaryCapillaryCapillaryCapillaryCapillary
Active phase HP-5MSDB-1DB-5MSHP-5Cross-Linked Methylsilicone
Column length (m) 30.60.30.60.25.
Carrier gas HeHeHe He
Substrate
Column diameter (mm) 0.250.250.250.250.2
Phase thickness (μm) 0.25 0.250.250.33
Tstart (C) 60.50.60.40.70.
Tend (C) 275.250.240.250.250.
Heat rate (K/min) 4.4.3.5.4.
Initial hold (min)    15.
Final hold (min)
I 1493.1483.1496.1494.1469.
ReferenceAfsharypuor and Jahromy, 2003Dabiri and Sefidkon, 2003Maia, Taveira, et al., 2003Stashenko, Jaramillo, et al., 2003Velasco-Negueruela, Pérez-Alonso, et al., 2003
Comment MSDC-RI MSDC-RI MSDC-RI MSDC-RI MSDC-RI
Column type CapillaryCapillaryCapillaryCapillaryCapillary
Active phase RSL-200DB-5MSCP Sil 5 CBDB-1DB-1
Column length (m) 30.30.25.50.50.
Carrier gas H2HeHeN2N2
Substrate
Column diameter (mm) 0.320.250.250.250.25
Phase thickness (μm) 0.250.250.390.250.25
Tstart (C) 40.60.60.80.95.
Tend (C) 280.240.220.225.240.
Heat rate (K/min) 6.3.5.4.4.
Initial hold (min) 5.
Final hold (min) 5.
I 1494.1497.1477.1473.1469.
ReferenceJirovetz, Buchbauer, et al., 2002Maia, Zoghbi, et al., 2002Mojab, Rustaiyan, et al., 2002Palá-Paúl, Pérez-Alonso, et al., 2002Velasco-Negueruela, Pérez-Alonso, et al., 2002
Comment MSDC-RI MSDC-RI MSDC-RI MSDC-RI MSDC-RI
Column type CapillaryCapillaryCapillaryCapillaryCapillary
Active phase SPB-5CBP-1SPB-5OV-101CP Sil 8 CB
Column length (m) 60.25.50.25.25.
Carrier gas HeNitrogenHe
Substrate
Column diameter (mm) 0.320.250.320.320.20
Phase thickness (μm)  0.250.25
Tstart (C) 40.50.60.50.60.
Tend (C) 220.210.240.200.230.
Heat rate (K/min) 3.3.3.5.3.
Initial hold (min) 5.2.  10.
Final hold (min) 15. 20.
I 1495.1489.1499.1494.1493.
ReferenceCornu, Carnat, et al., 2001Ly, Yamauchi, et al., 2001Doneanu and Anitescu, 1998Zollo, Biyiti, et al., 1998Jantan and Goh, 1990
Comment MSDC-RI MSDC-RI MSDC-RI MSDC-RI MSDC-RI
Column type CapillaryCapillary
Active phase SE-30SE-30
Column length (m) 30.30.
Carrier gas
Substrate
Column diameter (mm)
Phase thickness (μm)
Tstart (C) 50.50.
Tend (C) 240.240.
Heat rate (K/min) 4.4.
Initial hold (min) 2.2.
Final hold (min) 10.10.
I 1486.1486.
ReferenceRamaswami, Briscese, et al., 1988Ramaswami, Briscese, et al., 1986
Comment MSDC-RI MSDC-RI

Normal alkane RI, non-polar column, custom temperature program

Data compiled by: NIST Mass Spectrometry Data Center, William E. Wallace, director

Column type CapillaryCapillaryCapillaryCapillaryCapillary
Active phase VF-5VF-5HP-5HP-5HP-5
Column length (m) 30.30.  30.
Carrier gas HeliumHelium  Helium
Substrate
Column diameter (mm) 0.250.25  0.32
Phase thickness (μm) 0.250.25  0.25
Program 50 0C (2 min) 3 0C/min -> 200 0C (3 min) 10 0C/min -> 220 0C (8 min)not specifiednot specifiednot specifiednot specified
I 1515.1500.1489.1496.1494.
ReferenceShivashankar, Roy, et al., 2012Shivashankar, Roy, et al., 2012Citron, Riclea, et al., 2011Citron, Riclea, et al., 2011Kahriman, Tosun, et al., 2011
Comment MSDC-RI MSDC-RI MSDC-RI MSDC-RI MSDC-RI
Column type CapillaryCapillaryCapillaryCapillaryCapillary
Active phase HP-5 MSHP-5 MSRTX-1HP-5 MSHP-5
Column length (m)   60.30.25.
Carrier gas   HeliumHeliumHelium
Substrate
Column diameter (mm)   0.220.250.32
Phase thickness (μm)   0.250.250.17
Program not specifiednot specifiednot specified60 0C (1 min) 10 0C/min -> 180 0C (1 min) 20 0C/min -> 280 0C (15 min)60 0C (5 min) 4 0C/min -> 220 0C 11 0C/min -> 280 0C (15 min)
I 1495.1496.1483.1492.1492.
ReferencePayo, Colo, et al., 2011Payo, Colo, et al., 2011Dib, Djabou, et al., 2010Liu, Chu, et al., 2010Custer, 2009
Comment MSDC-RI MSDC-RI MSDC-RI MSDC-RI MSDC-RI
Column type CapillaryCapillaryCapillaryCapillaryCapillary
Active phase HP-5HP-5HP-5DB-1DB-1
Column length (m) 25.25.25.30.30.
Carrier gas HeliumHeliumHeliumHydrogenHydrogen
Substrate
Column diameter (mm) 0.320.320.320.250.25
Phase thickness (μm) 0.170.170.170.250.25
Program 60 0C (5 min) 4 0C/min -> 220 0C 11 0C/min -> 280 0C (15 min)not specifiednot specified45 0C 3 0C/min -> 175 0C 15 0C/min -> 300 0C (10 min)45 0C 3 0C/min -> 175 0C 15 0C/min -> 300 0C (10 min)
I 1494.1493.1493.1492.1492.
ReferenceCuster, 2009Custer, 2009Custer, 2009Mendes, Trindade, et al., 2009Mendes, Trindade, et al., 2009, 2
Comment MSDC-RI MSDC-RI MSDC-RI MSDC-RI MSDC-RI
Column type CapillaryCapillaryCapillaryCapillaryCapillary
Active phase DB-5DB-1HP-5MSHP-5MSHP-5MS
Column length (m) 30.30.30.30.30.
Carrier gas HeliumHeHeHeHe
Substrate
Column diameter (mm) 0.250.250.250.250.25
Phase thickness (μm) 0.250.10.250.250.25
Program 50 0C 95 min) 3 0C/min -> 100 0C 4 0C/min -> 160 0C 5 0C/min -> 220 0C (15 min)35C => 4C/min => 180C => 10C/min => 250C40C => 3C/min => 100C => 5C/min => 230C(2min)40C(10min) => 3C/min => 200C => 2C/min => 220C40C(3min) => 8C/min => 160C => 15C/min => 300C (10min)
I 1507.1494.1486.1509.1494.
ReferenceYang, Yang, et al., 2009Albuquerque, Vasconcelos Silva, et al., 2007Chokeprasert P., Charles A.L., et al., 2007Cole, Haber, et al., 2007Liu, Song, et al., 2007
Comment MSDC-RI MSDC-RI MSDC-RI MSDC-RI MSDC-RI
Column type CapillaryCapillaryCapillaryCapillaryCapillary
Active phase CP Sil 8 CBDB-5HP-5 MSHP-5MSHP-5MS
Column length (m) 50.30. 30.30.
Carrier gas HeHydrogen HeHe
Substrate
Column diameter (mm) 0.320.25 0.250.25
Phase thickness (μm) 0.250.25 0.250.25
Program 60 0C (2 min) 5 0C/min -> 160 0C 5 0C/min -> 250 0C (10 min)not specifiednot specified40C(3min) => 6C/min => 160C => 10C/min => 300C (10min)40C(1min) => 8C/min => 160C => 12C/min => 300C(5min)
I 1494.1495.1498.1498.1488.
ReferenceMockute, Bernotiene, et al., 2007Pontes, de Olivera, et al., 2007Stokes, Cole, et al., 2007Yu, Huang, et al., 2007Li, Deng, et al., 2006
Comment MSDC-RI MSDC-RI MSDC-RI MSDC-RI MSDC-RI
Column type CapillaryCapillaryCapillaryCapillaryCapillary
Active phase HP-5 MSHP-5MSSE-52DB-1DB-1
Column length (m) 30.30.30.30.30.
Carrier gas HeliumHeHeHeHe
Substrate
Column diameter (mm) 0.250.320.320.250.25
Phase thickness (μm) 0.250.250.150.250.25
Program 40 0C (10 min) 3 0C/min -> 200 0C 2 0C/min -> 220 0C60C(1min) => 1.5C => 185C => 9C/min => 275C (2min)45C => 1C/min => 100C => 5C/min => 250C (10min)35C => 2C/min => 200C => 5C/min => 240C45C => 3C/min => 175C => 15C/min => 300C(10min)
I 1498.1495.1494.1473.1492.
ReferenceSchmidt, Noletto, et al., 2006Singh G., Maurya S., et al., 2006Tognolini, Barocelli, et al., 2006Al-Burtamani, Fatope, et al., 2005Belhattab, Larous, et al., 2005
Comment MSDC-RI MSDC-RI MSDC-RI MSDC-RI MSDC-RI
Column type CapillaryCapillaryCapillaryCapillaryCapillary
Active phase CP Sil 8 CBHP-5SE-30SE-30SE-30
Column length (m) 50.30.  60.
Carrier gas He   He
Substrate
Column diameter (mm) 0.320.32  0.25
Phase thickness (μm) 0.25
Program 60C(1min) => 5C/min => 160C => 5C/min => 250C(3min)65C(1min) => 1C/min => 75C (2min) => 0.5C/min => 81C(2min) => 3C/min => 180C(7min)not specifiednot specified50 0C (5 min) 5 0C/min -> 165 0C 4 0C/min -> 230 0C
I 1495.1495.1487.1520.1501.
ReferenceNivinskienë, Butkienë, et al., 2005Singh, Maurya, et al., 2005Vinogradov, 2004Vinogradov, 2004Li, Wu, et al., 2002
Comment MSDC-RI MSDC-RI MSDC-RI MSDC-RI MSDC-RI
Column type CapillaryCapillaryCapillaryCapillaryCapillary
Active phase SE-30HP-5DB-1CP Sil 5 CBDB-1
Column length (m) 60.30.30.25.30.
Carrier gas He HeN2H2
Substrate
Column diameter (mm) 0.250.250.250.250.25
Phase thickness (μm)  0.250.250.390.25
Program not specifiednot specified45C => 3C/min => 170C => 15C/min => 300C(10min)not specified45C => 3C/min => 175C => 15C/min => 240C(10min)
I 1502.1494.1492.1487.1492.
ReferenceLi, Wu, et al., 2002Aparicio, Romero, et al., 2001Pedro, da Silva, et al., 1999Weyerstahl, Marschall, et al., 1999Figueiredo, Barroso, et al., 1997
Comment MSDC-RI MSDC-RI MSDC-RI MSDC-RI MSDC-RI
Column type CapillaryCapillaryCapillaryCapillary
Active phase CP Sil 5 CBDB-1Methyl SiliconeDB-5
Column length (m) 25.30. 30.
Carrier gas HeH2
Substrate
Column diameter (mm)  0.25 0.32
Phase thickness (μm)  0.25 1.
Program not specified45 0C 3 0C/min -> 175 0C 15 0C/min -> 240 0C (10 min)not specified0C(5min) => 60C/min => 60C (5min) => 4C/min => 250C (5min)
I 1488.1492.1487.1490.
ReferenceWeyerstahl, Marschall, et al., 1997Barroso, Figueiredo, et al., 1996Zenkevich, 1996Storer, Elmore, et al., 1993
Comment MSDC-RI MSDC-RI MSDC-RI MSDC-RI

Kovats' RI, polar column, isothermal

Data compiled by: NIST Mass Spectrometry Data Center, William E. Wallace, director

Column type Packed
Active phase Carbowax 20M
Column length (m)
Carrier gas
Substrate
Column diameter (mm)
Phase thickness (μm)
Temperature (C) 165.
I 1738.
ReferenceAndersen and Falcone, 1969
Comment MSDC-RI

References

Sun, Hua, et al., 2010
Sun, Q.-L.; Hua, S.; Ye, J.-H.; Zheng, X.-Q.; Liang, Y.-R., Flavonoids and volatiles in Chrysanthemum morifolium Ramat flower from Tongxiang County in China, Afr. J. Biotechnol., 2010, 9, 25, 3817-3821. [all data]

Vichi, Guadayol, et al., 2007
Vichi, S.; Guadayol, J.M.; Caixach, J.; López-Tamames, E.; Buxaderas, S., Analytical, Nutritional, and Clinical Methods. Comparative study of different extraction techniques for the analysis of virgin olive oil aroma, Food Chem., 2007, 105, 3, 1171-1178, https://doi.org/10.1016/j.foodchem.2007.02.018 . [all data]

Kürkçüoglu, Hüsnü Can Baser, et al., 2006
Kürkçüoglu, M.; Hüsnü Can Baser, K.; Iscan, G.; Malyer, H.; Kaynak, G., Composition and anticandidal activity of the essential oil of Chaerophyllum byzantinum Boiss., Flavour Fragr. J., 2006, 21, 1, 115-117, https://doi.org/10.1002/ffj.1539 . [all data]

Suleimenov Y.M., Atazhanova G.A., et al., 2006
Suleimenov Y.M.; Atazhanova G.A.; Ozek T.; Demirci B.; Kulyyasov A.T.; Adekenov S.M.; Baser K.H.C., Essential oil composition of three species of Achillea from Kazakhstan, Chem. Nat. Compd. (Engl. Transl.), 2006, 37, 5, 447-450, https://doi.org/10.1023/A:1014471326724 . [all data]

Tabanca, Demirci, et al., 2006
Tabanca, N.; Demirci, B.; Ozek, T.; Kirimer, N.; Can Baser, K.H.; Bedir, E.; Khan, I.A.; Wedge, D.E., Gas chromatographic-mass spectrometric analysis of essential oils from Pimpinella species gathered from Central and Northern Turkey, J. Chromatogr. A, 2006, 1117, 2, 194-205, https://doi.org/10.1016/j.chroma.2006.03.075 . [all data]

Vichi, Guadayol, et al., 2006
Vichi, S.; Guadayol, J.M.; Caixach, J.; López-Tamames, E.; Buxaderas, S., Monoterpene and sesquiterpene hydrocarbons of virgin olive oil by headspace solid-phase microextraction coupled to gas chromatography/mass spectrometry, J. Chromatogr. A, 2006, 1125, 1, 117-123, https://doi.org/10.1016/j.chroma.2006.05.029 . [all data]

Duman, Kartal, et al., 2005
Duman, H.; Kartal, M.; Altun, L.; Demirci, B.; Baser, K.H.C., The essential oil of Stachys laetivirens Kotschy Boiss. ex Rech. fil., endemic in Turkey, Flavour Fragr. J., 2005, 20, 1, 48-50, https://doi.org/10.1002/ffj.1362 . [all data]

Tabanca, Demirci, et al., 2005
Tabanca, N.; Demirci, B.; Kirimer, N.; Baser, K.H.C.; Bedir, E.; Khand, I.A.; Wedge, D.E., Gas chromatographic-mass spectrometric analysis of essential oils from Pimpinella aurea, Pimpinella corymbosa, Pimpinella peregrina and Pimpinella puberula gathered from Eastern and Southern Turkey, J. Chromatogr. A, 2005, 1097, 1-2, 192-198, https://doi.org/10.1016/j.chroma.2005.10.047 . [all data]

Vinogradov, 2004
Vinogradov, B.A., Production, composition, properties and application of essential oils, 2004, retrieved from http://viness.narod.ru. [all data]

Baser, Demirei, et al., 2002
Baser, K.H.C.; Demirei, B.; Özek, T.; Akalin, E.; Özhatay, N., Micro-distilled volatile compounds from Ferulago species growing in Western Turkey, Pharm. Biol., 2002, 40, 6, 466-471, https://doi.org/10.1076/phbi.40.6.466.8439 . [all data]

Kirimer, Tabanca, et al., 2000
Kirimer, N.; Tabanca, N.; Özek, T.; Tümen, G.; Baser, K.H.C., Essential oils of annual Sideritis species growing in Turkey, Pharm. Biol., 2000, 38, 2, 106-111, https://doi.org/10.1076/1388-0209(200004)3821-1FT106 . [all data]