Furazan, methylnitro-, 2-oxide

Condensed phase thermochemistry data

Data compiled by: Hussein Y. Afeefy, Joel F. Liebman, and Stephen E. Stein

Quantity Value Units Method Reference Comment
Δfsolid24.1 ± 0.2kcal/molCcbNikolaeva, Matyushin, et al., 1972
Quantity Value Units Method Reference Comment
Δcsolid-408.7 ± 0.2kcal/molCcbNikolaeva, Matyushin, et al., 1972

References

Nikolaeva, Matyushin, et al., 1972
Nikolaeva, A.D.; Matyushin, Yu.N.; Pepekin, V.I.; Smelov, V.S.; Bulidorov, V.V.; Bulidorova, T.I.; Apin, A.Ya., Synthesis and study of detonation properties of 3-methyl-4-nitrofuroxan, Bull. Acad. Sci. USSR, Div. Chem. Sci., 1972, 927-928. [all data]