5H-Dibenz[b,f]azepine, 10,11-dihydro-

Gas phase ion energetics data

Data compiled by: Sharon G. Lias, Rhoda D. Levin, and Sherif A. Kafafi

Ionization energy determinations

IE (eV) Method Reference Comment
7.25PEHaink, Adams, et al., 1974Vertical value

Normal alkane RI, non-polar column, custom temperature program

View large format table.

Column type Active phase I Reference Comment
PackedOV-1011931.Maurer and Pfleger, 1984Program: not specified
PackedOV-1011931.Maurer and Pfleger, 1984Program: not specified
PackedOV-1011931.Maurer and Pfleger, 1984Program: not specified
PackedOV-1011980.Maurer and Pfleger, 1984Program: not specified
PackedOV-1011931.Maurer and Pfleger, 1984Program: not specified

References

Haink, Adams, et al., 1974
Haink, H.J.; Adams, J.E.; Huber, J.R., The electronic structure of aromatic amines: photoelectron spectroscopy of diphenylamine, iminobibenzyl, acridan and carbazole, Ber. Bunsen-Ges. Phys. Chem., 1974, 78, 436. [all data]

Teuber and Schmidtke, 1960
Teuber, H.-J.; Schmidtke, W., Versuche mit o.o'-imino-dibenzyl, Chem. Ber., 1960, 93, 6, 1257-1268. [all data]

Maurer and Pfleger, 1984
Maurer, H.; Pfleger, K., Screening procedure for detection of antidepressants and their metabolites in urine using a computerized gas chromatographic-mass spectrometric technique, J. Chromatogr., 1984, 305, 309-323, https://doi.org/10.1016/S0378-4347(00)83345-9 . [all data]