1,3,5-Triazine, 2,4,6-triphenyl-

Condensed phase thermochemistry data

Data compiled by: Hussein Y. Afeefy, Joel F. Liebman, and Stephen E. Stein

Quantity Value Units Method Reference Comment
Δfsolid282.7 ± 6.3kJ/molCcrLebedev, Bykova, et al., 1984
Quantity Value Units Method Reference Comment
Δcsolid-10689.7 ± 6.3kJ/molCcrLebedev, Bykova, et al., 1984

References

Lebedev, Bykova, et al., 1984
Lebedev, B.V.; Bykova, T.A.; Kiparisova, E.G.; Pankratov, V.A.; Mitina, L.M.; Korshak, V.V., Thermodynamics of benzonitrile, of its cyclotrimerization process, and of the triphenyl-s-triazine formed in the range 0-300°K, J. Gen. Chem. USSR, 1984, 54, 1209-1214. [all data]