Bicyclo[1.1.0]butane-1-carboxcylic acid methyl ester

Gas phase thermochemistry data

Data compiled by: Hussein Y. Afeefy, Joel F. Liebman, and Stephen E. Stein

Quantity Value Units Method Reference Comment
Δfgas-164.6kJ/molCcrHall and Baldt, 1971

Condensed phase thermochemistry data

Data compiled by: Hussein Y. Afeefy, Joel F. Liebman, and Stephen E. Stein

Quantity Value Units Method Reference Comment
Δfliquid-203.2kJ/molCcrHall and Baldt, 1971
Quantity Value Units Method Reference Comment
Δcliquid-3301.3 ± 0.50kJ/molCcrHall and Baldt, 1971Corresponding Δfliquid = -203.1 kJ/mol (simple calculation by NIST; no Washburn corrections)

References

Hall and Baldt, 1971
Hall, H.K., Jr.; Baldt, J.H., Thermochemistry of strained-ring bridgehead nitriles and esters, J. Am. Chem. Soc., 1971, 93, 140-145. [all data]