(-)-Norephedrine

Normal alkane RI, non-polar column, custom temperature program

Data compiled by: NIST Mass Spectrometry Data Center, William E. Wallace, director

Column type CapillaryCapillaryOtherCapillary
Active phase BP-1BP-1Methyl SiliconeApieson L / KOH
Column length (m) 12.12.
Carrier gas HeHe
Substrate
Column diameter (mm) 0.220.22
Phase thickness (μm) 0.250.25
Program 120 0X 8 0C/min -> 270 0C 25 0C/min -> 300 0C (5 min)not specifiednot specifiednot specified
I 1304.1310.1313.1326.
ReferenceStowell and Wilson, 1985Stowell and Wilson, 1985Ardrey and Moffat, 1981Caddy, Fish, et al., 1973
Comment MSDC-RI MSDC-RI MSDC-RI MSDC-RI

Kovats' RI, non-polar column, custom temperature program

Data compiled by: NIST Mass Spectrometry Data Center, William E. Wallace, director

Column type PackedPacked
Active phase OV-101SE-30
Column length (m) 2.2.
Carrier gas N2
Substrate Chromosorb W
Column diameter (mm)
Phase thickness (μm)
Program not specifiednot specified
I 1310.1310.
ReferenceMcLinden and Stenhouse, 1979Moffat, Stead, et al., 1974
Comment MSDC-RI MSDC-RI

Kovats' RI, non-polar column, temperature ramp

View large format table.

Column type Active phase I Reference Comment
CapillarySE-301291.Schepers, Wijsbeek, et al., 198225. m/0.49 mm/1.14 μm, 100. C @ 2. min, 8. K/min, 275. C @ 15. min

Kovats' RI, polar column, custom temperature program

View large format table.

Column type Active phase I Reference Comment
PackedCarbowax 20M2231.Moffat, Stead, et al., 1974Column length: 1. m; Program: not specified

Van Den Dool and Kratz RI, non-polar column, temperature ramp

View large format table.

Column type Active phase I Reference Comment
CapillarySPB-11313.Christ, Noomano, et al., 198830. m/0.75 mm/1.0 μm, He, 10. K/min, 280. C @ 12. min; Tstart: 160. C
CapillaryDB-11308.Perrigo, Peel, et al., 198515. m/0.32 mm/0.25 μm, He, 8. K/min, 280. C @ 5. min; Tstart: 120. C
CapillaryDB-11308.Perrigo, Ballantyne, et al., 198415. m/0.25 mm/0.25 μm, He, 8. K/min, 280. C @ 5. min; Tstart: 120. C
CapillarySE-301287.Anderson and Stafford, 198315. m/0.25 mm/0.25 μm, He, 5. K/min; Tstart: 100. C; Tend: 295. C
PackedSE-301300.Perrigo and Peel, 1981N2, Chromosorb W, 130. C @ 2. min, 8. K/min, 290. C @ 8. min; Column length: 1.8 m

Van Den Dool and Kratz RI, non-polar column, custom temperature program

View large format table.

Column type Active phase I Reference Comment
CapillaryBP-11304.Stowell and Wilson, 198712. m/0.22 mm/0.25 μm, He; Program: 120C => 8C/min => 270C => 25C/min => 300C

Normal alkane RI, non-polar column, isothermal

View large format table.

Column type Active phase Temperature (C) I Reference Comment
CapillaryApieson L / KOH150.1321.Caddy, Fish, et al., 1973
CapillaryApieson L / KOH150.1331.Caddy, Fish, et al., 1973
CapillaryApieson L / KOH150.1331.Caddy, Fish, et al., 1973
CapillaryApieson L / KOH150.1332.Caddy, Fish, et al., 1973
CapillaryApieson L / KOH150.1339.Caddy, Fish, et al., 1973

Normal alkane RI, non-polar column, temperature ramp

View large format table.

Column type Active phase I Reference Comment
CapillaryDB-51289.Phillips, Logan, et al., 199015. m/0.25 mm/0.2 μm, He, 10. K/min; Tstart: 100. C; Tend: 150. C
CapillaryBP-11287.Stowell and Wilson, 198512. m/0.22 mm/0.25 μm, He, 5. K/min; Tstart: 100. C; Tend: 295. C
CapillaryBP-11308.Stowell and Wilson, 198512. m/0.22 mm/0.25 μm, He, 8. K/min; Tstart: 120. C; Tend: 280. C

References

Stowell and Wilson, 1985
Stowell, A.; Wilson, L., Use of retention indices in drug screening by capillary gas chromatography, Rep. # CD 2362, Department of Scientific and Industrial Reseach, Chemistry Division, Lower Hutt, NZ, 1985, 32. [all data]

Ardrey and Moffat, 1981
Ardrey, R.E.; Moffat, A.C., Gas-liquid chromatographic retention indices of 1318 substances of toxicological interest on SE-30 or OV-1 stationary phase, J. Chromatogr., 1981, 220, 3, 195-252, https://doi.org/10.1016/S0021-9673(00)81925-1 . [all data]

Caddy, Fish, et al., 1973
Caddy, B.; Fish, F.; Scott, D., Chromatographic screening for drugs of abuse using capillary columds. II. Peak identification on support coated open tubular columns for a series of central nervous system stimulating drugs, Chromatographia, 1973, 6, 7, 293-300, https://doi.org/10.1007/BF02269329 . [all data]