Cathine

Kovats' RI, non-polar column, isothermal

View large format table.

Column type Active phase Temperature (C) I Reference Comment
PackedOV-101150.1319.Huber, Kenndler, et al., 1979N2; Column length: 2. m
PackedApiezon L150.1342.Huber, Kenndler, et al., 1979
PackedApiezon L150.1342.Donike and Stratmann, 1976Chromosorb W

Van Den Dool and Kratz RI, non-polar column, custom temperature program

View large format table.

Column type Active phase I Reference Comment
CapillaryBP-11303.Stowell and Wilson, 198712. m/0.22 mm/0.25 μm, He; Program: 120C => 8C/min => 270C => 25C/min => 300C

Normal alkane RI, non-polar column, isothermal

View large format table.

Column type Active phase Temperature (C) I Reference Comment
CapillaryApieson L / KOH190.1361.Caddy, Fish, et al., 1973
CapillaryApieson L / KOH190.1369.Caddy, Fish, et al., 1973
CapillaryApieson L / KOH190.1377.Caddy, Fish, et al., 1973

Normal alkane RI, non-polar column, custom temperature program

View large format table.

Column type Active phase I Reference Comment
CapillaryBP-11303.Stowell and Wilson, 198512. m/0.22 mm/0.25 μm, He; Program: 120 0X 8 0C/min -> 270 0C 25 0C/min -> 300 0C (5 min)
CapillaryBP-11310.Stowell and Wilson, 198512. m/0.22 mm/0.25 μm, He; Program: not specified
OtherMethyl Silicone1302.Ardrey and Moffat, 1981Program: not specified
OtherMethyl Silicone1362.Ardrey and Moffat, 1981Program: not specified

Normal alkane RI, polar column, isothermal

View large format table.

Column type Active phase Temperature (C) I Reference Comment
CapillaryCarbowax 20M / KOH190.2333.Caddy, Fish, et al., 1973
CapillaryCarbowax 20M / KOH190.2341.Caddy, Fish, et al., 1973
CapillaryCarbowax 20M / KOH190.2358.Caddy, Fish, et al., 1973

References

Huber, Kenndler, et al., 1979
Huber, J.F.K.; Kenndler, E.; Reich, G., Quantitation of the Information Content of Multi-Dimensional Gas Chromatography and Low- Resolution Mass Spectrometry in the Identification of Doping Drugs, J. Chromatogr., 1979, 172, 1, 15-30, https://doi.org/10.1016/S0021-9673(00)90941-5 . [all data]

Donike and Stratmann, 1976
Donike, M.; Stratmann, D., Gas-chromatographische identifizierung von stimulantien der phenyläthylaminreihe mit hilfe der retnetions-indices, Z. Anal. Chem., 1976, 279, 2, 129-131, https://doi.org/10.1007/BF00440798 . [all data]

Stowell and Wilson, 1987
Stowell, A.; Wilson, L.W., A simple approach to the interlaboratory transfer of drug retention indices determined by temperature programmed capillary gas chromatography, J. Forensic Sci., 1987, 32, 5, 1214-1220. [all data]

Caddy, Fish, et al., 1973
Caddy, B.; Fish, F.; Scott, D., Chromatographic screening for drugs of abuse using capillary columds. II. Peak identification on support coated open tubular columns for a series of central nervous system stimulating drugs, Chromatographia, 1973, 6, 7, 293-300, https://doi.org/10.1007/BF02269329 . [all data]

Stowell and Wilson, 1985
Stowell, A.; Wilson, L., Use of retention indices in drug screening by capillary gas chromatography, Rep. # CD 2362, Department of Scientific and Industrial Reseach, Chemistry Division, Lower Hutt, NZ, 1985, 32. [all data]

Ardrey and Moffat, 1981
Ardrey, R.E.; Moffat, A.C., Gas-liquid chromatographic retention indices of 1318 substances of toxicological interest on SE-30 or OV-1 stationary phase, J. Chromatogr., 1981, 220, 3, 195-252, https://doi.org/10.1016/S0021-9673(00)81925-1 . [all data]