Benzene, 1-ethyl-3-(1-methylethyl)-

Normal alkane RI, polar column, isothermal

Data compiled by: NIST Mass Spectrometry Data Center, William E. Wallace, director

Column type CapillaryCapillaryCapillaryCapillaryCapillary
Active phase PEG-40MPEG-40MPEG-40MPEG-40MPEG-40M
Column length (m) 50.50.50.50.50.
Carrier gas
Substrate
Column diameter (mm)
Phase thickness (μm)
Temperature (C) 100.100.120.140.160.
I 1339.1340.1349.1360.1371.
ReferenceNesterov, Nesterova, et al., 2000Nesterov, Nesterova, et al., 2000Nesterov, Nesterova, et al., 2000Nesterov, Nesterova, et al., 2000Nesterov, Nesterova, et al., 2000
Comment MSDC-RI MSDC-RI MSDC-RI MSDC-RI MSDC-RI
Column type Capillary
Active phase PEG-40M
Column length (m) 50.
Carrier gas
Substrate
Column diameter (mm)
Phase thickness (μm)
Temperature (C) 80.
I 1331.
ReferenceNesterov, Nesterova, et al., 2000
Comment MSDC-RI

Kovats' RI, polar column, isothermal

Data compiled by: NIST Mass Spectrometry Data Center, William E. Wallace, director

Column type Capillary
Active phase Carbowax 20M
Column length (m) 100.
Carrier gas
Substrate
Column diameter (mm) 0.2
Phase thickness (μm)
Temperature (C) 90.
I 1305.2
ReferenceDöring, Estel, et al., 1974
Comment MSDC-RI

Phase change data

Data compiled as indicated in comments:
TRC - Thermodynamics Research Center, NIST Boulder Laboratories, Chris Muzny director
AC - William E. Acree, Jr., James S. Chickos

Quantity Value Units Method Reference Comment
Tboil464.KN/AWidman, 1891Uncertainty assigned by TRC = 6. K; TRC
Tboil464.KN/ABecke, 1890Uncertainty assigned by TRC = 6. K; TRC

Enthalpy of vaporization

ΔvapH (kcal/mol) Temperature (K) Method Reference Comment
11.7316.AStephenson and Malanowski, 1987Based on data from 301. - 466. K. See also Stull, 1947.; AC

In addition to the Thermodynamics Research Center (TRC) data available from this site, much more physical and chemical property data is available from the following TRC products:

Kovats' RI, non-polar column, temperature ramp

Data compiled by: NIST Mass Spectrometry Data Center, William E. Wallace, director

Column type Capillary
Active phase OV-101
Column length (m) 110.
Carrier gas He
Substrate
Column diameter (mm) 0.25
Phase thickness (μm) 0.20
Tstart (C) 35.
Tend (C) 200.
Heat rate (K/min) 1.
Initial hold (min)
Final hold (min)
I 1089.
ReferenceHayes and Pitzer, 1982
Comment MSDC-RI

References

Nesterov, Nesterova, et al., 2000
Nesterov, I.A.; Nesterova, T.N.; Pimerzin, A.A.; Tsvetkov, V.S., Thermodynamics of alkylbenzene sorption and evaporation. IV. Enthalpies of evaporation and thermodynamics chracteristics of sorption by stationary phases OV-101 and PEG-40M, Izvestia vysshikh uchebnykh zavedenii. Khimia i khimicheskaia tekhnologia (Chemistry and chemical technology), 2000, 43, 4, 39-45. [all data]