4H-1-Benzopyran-4-one
- Formula: C9H6O2
- Molecular weight: 146.1427
- IUPAC Standard InChIKey: OTAFHZMPRISVEM-UHFFFAOYSA-N
- CAS Registry Number: 491-38-3
- Chemical structure:

Gas phase thermochemistry data

Data compiled by: Hussein Y. Afeefy, Joel F. Liebman, and Stephen E. Stein
Quantity | Value | Units | Method | Reference | Comment |
---|---|---|---|---|---|
ΔfH°gas | -148.5 ± 2.9 | kJ/mol | Ccb | Sabbah and El Watik, 1988 | Hfusion=17.31±0.19 kJ/mol |

Condensed phase thermochemistry data

Data compiled as indicated in comments:
ALS - Hussein Y. Afeefy, Joel F. Liebman, and Stephen E. Stein
DH - Eugene S. Domalski and Elizabeth D. Hearing
Quantity | Value | Units | Method | Reference | Comment |
---|---|---|---|---|---|
ΔfH°solid | -229.8 ± 2.9 | kJ/mol | Ccb | Sabbah and El Watik, 1988 | Hfusion=17.31±0.19 kJ/mol; ALS |
Quantity | Value | Units | Method | Reference | Comment |
ΔcH°solid | -4169.3 ± 2.9 | kJ/mol | Ccb | Sabbah and El Watik, 1988 | Hfusion=17.31±0.19 kJ/mol; Corresponding ΔfHºsolid = -229.8 kJ/mol (simple calculation by NIST; no Washburn corrections); ALS |
Constant pressure heat capacity of solid
Cp,solid (J/mol*K) | Temperature (K) | Reference | Comment |
---|---|---|---|
176.8 | 298.15 | Sabbah and El Watik, 1988 | DH |

Phase change data

Data compiled as indicated in comments:
TRC - Thermodynamics Research Center, NIST Boulder Laboratories, Chris Muzny director
DH - Eugene S. Domalski and Elizabeth D. Hearing
AC - William E. Acree, Jr., James S. Chickos
ALS - Hussein Y. Afeefy, Joel F. Liebman, and Stephen E. Stein
DRB - Donald R. Burgess, Jr.
Quantity | Value | Units | Method | Reference | Comment |
---|---|---|---|---|---|
Ttriple | 330.27 | K | N/A | Sabbah and Watik, 1988 | Uncertainty assigned by TRC = 0.04 K; TRC |
Quantity | Value | Units | Method | Reference | Comment |
ΔsubH° | 86.5 ± 1.1 | kJ/mol | C | Matos, Sousa, et al., 2009 | AC |
ΔsubH° | 81.29 ± 0.16 | kJ/mol | C | Sabbah and El Watik, 1988 | Hfusion=17.31±0.19 kJ/mol; ALS |
ΔsubH° | 81.3 | kJ/mol | N/A | Sabbah and El Watik, 1988 | DRB |
ΔsubH° | 81.3 ± 0.2 | kJ/mol | C | Sabbah and Watik, 1988 | AC |
Enthalpy of vaporization
ΔvapH (kJ/mol) | Temperature (K) | Reference | Comment |
---|---|---|---|
81.290 | 298.15 | Sabbah and El Watik, 1988 | DH |
Enthalpy of fusion
ΔfusH (kJ/mol) | Temperature (K) | Method | Reference | Comment |
---|---|---|---|---|
17.310 | 330.27 | N/A | Sabbah and El Watik, 1988 | DH |
15.44 | 329.9 | DSC | Matos, Sousa, et al., 2009 | AC |
17.31 | 330.3 | N/A | Acree, 1991 | See also Domalski and Hearing, 1996.; AC |

References

Sabbah and El Watik, 1988
Sabbah, R.; El Watik, L.,
Thermodynamic study of two simple molecules encountered as products of the pyrolysis of coal: chromone and xanthone,
Bull. Soc. Chim. France, 1988, 626-630. [all data]
Sabbah and Watik, 1988
Sabbah, R.; Watik, L.E.,
Thermodynamic study of two simple molecules encountered as products of the pyrolysis of coal: chromone and xanthone,
Bull. Soc. Chim. Fr., 1988, 4, 626. [all data]
Matos, Sousa, et al., 2009
Matos, M. Agostinha R.; Sousa, Clara C.S.; Miranda, Margarida S.; Morais, Victor M.F.; Liebman, Joel F.,
Energetics of Coumarin and Chromone,
J. Phys. Chem. B, 2009, 113, 32, 11216-11221, https://doi.org/10.1021/jp9026942
. [all data]
Acree, 1991
Acree, William E.,
Thermodynamic properties of organic compounds: enthalpy of fusion and melting point temperature compilation,
Thermochimica Acta, 1991, 189, 1, 37-56, https://doi.org/10.1016/0040-6031(91)87098-H
. [all data]
Domalski and Hearing, 1996
Domalski, Eugene S.; Hearing, Elizabeth D.,
Heat Capacities and Entropies of Organic Compounds in the Condensed Phase. Volume III,
J. Phys. Chem. Ref. Data, 1996, 25, 1, 1, https://doi.org/10.1063/1.555985
. [all data]