4(1H)-Quinazolinone

Kovats' RI, non-polar column, isothermal

Data compiled by: NIST Mass Spectrometry Data Center, William E. Wallace, director

Column type Packed
Active phase OV-1
Column length (m)
Carrier gas
Substrate
Column diameter (mm)
Phase thickness (μm)
Temperature (C) 220.
I 1733.
ReferencePapp, Szász, et al., 1991
Comment MSDC-RI

Normal alkane RI, non-polar column, custom temperature program

Data compiled by: NIST Mass Spectrometry Data Center, William E. Wallace, director

Column type Capillary
Active phase OV-1
Column length (m)
Carrier gas
Substrate
Column diameter (mm)
Phase thickness (μm)
Program not specified
I 1733.
ReferenceZhang, Li, et al., 2003
Comment MSDC-RI

References

Papp, Szász, et al., 1991
Papp, O.; Szász, Gy.; Orfi, L.; Hermecz, I., Correlation between structure and gas chromatographic behaviour of nitrogen-containing heterocyclic compounds. II. Alkyl substitution of quinazolone derivatives, J. Chromatogr., 1991, 537, 371-376, https://doi.org/10.1016/S0021-9673(01)88910-X . [all data]