1-Phenylcyclohexane-1,2-diol cis-

Condensed phase thermochemistry data

Data compiled by: Hussein Y. Afeefy, Joel F. Liebman, and Stephen E. Stein

Quantity Value Units Method Reference Comment
Δcsolid-6540.0kJ/molCcbRoth and Muller, 1929Corresponding Δfsolid = -468.6 kJ/mol (simple calculation by NIST; no Washburn corrections)
Δcsolid-6532.9 ± 0.4kJ/molCcbVerkade, Coops, et al., 1928At 288 °K; Corresponding Δfsolid = -475.7 kJ/mol (simple calculation by NIST; no Washburn corrections)

References

Roth and Muller, 1929
Roth, W.A.; Muller, Fr., Die Zersetzungswarme der Stickstoffwasserstoffsaure, Ber., 1929, 62, 1188-1194. [all data]

Verkade, Coops, et al., 1928
Verkade, P.E.; Coops, J., Jr.; Maan, Chr.J., Calorimetrische Untersuchungen. XV. Thermochemische studien uber cycloparaffine und ihre derivate: 1. Experimentelle daten fur funf- und sechsgliedrige cyclische diole, Ann., 1928, 467, 217-239. [all data]