Cyclohexanone, 5-methyl-2-(1-methylethyl)-, cis-

Van Den Dool and Kratz RI, polar column, temperature ramp

Data compiled by: NIST Mass Spectrometry Data Center, William E. Wallace, director

Column type CapillaryCapillaryCapillaryCapillaryCapillary
Active phase DB-WaxFFAPBP-20DB-WaxCarbowax 20M
Column length (m) 30.20.50.25.60.
Carrier gas HeHe HeHe
Substrate
Column diameter (mm) 0.250.250.220.250.32
Phase thickness (μm) 0.250.250.250.250.425
Tstart (C) 40.90.60.50.45.
Tend (C) 240.220.220.240.300.
Heat rate (K/min) 6.4.2.4.3.
Initial hold (min) 10.2. 3.3.
Final hold (min) 25. 20. 20.
I 1465.1478.1481.1476.1484.
ReferenceVarming, Andersen, et al., 2006Agnihotri, Agarwal, et al., 2005Baldovini, Ristorcelli, et al., 2000Möllenbeck, König, et al., 1997Mondello, Dugo, et al., 1995
Comment MSDC-RI MSDC-RI MSDC-RI MSDC-RI MSDC-RI

Kovats' RI, non-polar column, isothermal

View large format table.

Column type Active phase Temperature (C) I Reference Comment
CapillarySE-30100.1152.9Tudor, 199740. m/0.35 mm/0.35 μm

Kovats' RI, non-polar column, temperature ramp

View large format table.

Column type Active phase I Reference Comment
CapillaryHP-5MS1178.Jalali-Heravi, Zekavat, et al., 200660. m/0.25 mm/0.25 μm, He, 40. C @ 1. min, 3. K/min, 250. C @ 20. min
CapillaryHP-5MS1159.Tepe, Sokmen, et al., 200530. m/0.25 mm/0.25 μm, He, 3. K/min; Tstart: 50. C; Tend: 240. C
CapillarySPB-51174.Gauvin, Lecomte, et al., 200460. m/0.32 mm/1. μm, He, 4. K/min, 200. C @ 30. min; Tstart: 60. C
CapillaryBP-11153.Srivastava, Ahmad, et al., 200325. m/0.55 mm/0.25 μm, N2, 5. K/min, 220. C @ 15. min; Tstart: 60. C
CapillaryCross-Linked Methylsilicone1149.Rajeswara Rao, Kaul, et al., 200250. m/0.2 mm/0.25 μm, He, 4. K/min; Tstart: 100. C; Tend: 280. C
CapillaryBP-11149.Rajeswara Rao, 200225. m/0.5 mm/0.25 μm, N2, 5. K/min, 220. C @ 10. min; Tstart: 60. C
CapillaryBP-11149.Rao B.R.R., 200225. m/0.5 mm/0.25 μm, 5. K/min, 220. C @ 10. min; Tstart: 60. C
CapillaryBP-11149.Rao B.R.R., 200225. m/0.5 mm/0.25 μm, 5. K/min, 220. C @ 10. min; Tstart: 60. C
CapillaryBP-11148.Jain, Aggarwal, et al., 200125. m/0.55 mm/0.25 μm, N2, 5. K/min, 220. C @ 15. min; Tstart: 60. C
CapillaryHP-51164.Kitic, Palic, et al., 200125. m/0.32 mm/0.52 μm, H2, 4. K/min; Tstart: 40. C; Tend: 240. C
CapillaryBP-11147.Rao, Kaul, et al., 2000N2, 5. K/min, 220. C @ 10. min; Column length: 25. m; Column diameter: 0.5 mm; Tstart: 60. C
CapillaryDB-51170.Rao, Rout, et al., 2000He, 2. K/min; Column length: 30. m; Column diameter: 0.25 mm; Tstart: 60. C; Tend: 180. C
CapillaryBP-11147.Rao, Sastry, et al., 200025. m/0.50 mm/0.25 μm, N2, 5. K/min, 220. C @ 10. min; Tstart: 60. C
CapillaryDB-51133.Senatore and de Feo, 199930. m/0.25 mm/0.33 μm, He, 40. C @ 5. min, 2. K/min, 260. C @ 20. min
CapillaryDB-51132.de Feo, Porta, et al., 199830. m/0.25 mm/0.25 μm, He, 40. C @ 5. min, 2. K/min, 250. C @ 20. min
CapillaryBP-11149.Kulkarni, Mallavarapu, et al., 1998N2, 5. K/min; Column length: 25. m; Column diameter: 0.25 mm; Tstart: 60. C; Tend: 220. C
CapillaryDB-51133.Senatore, Urrunaga Soria, et al., 199830. m/0.25 mm/0.25 μm, He, 40. C @ 5. min, 2. K/min, 250. C @ 20. min
CapillaryDB-51133.Senatore, 199830. m/0.25 mm/0.25 μm, He, 40. C @ 5. min, 2. K/min, 250. C @ 20. min
CapillaryDB-51132.Senatore, Urrunaga Soria, et al., 199730. m/0.25 mm/0.25 μm, He, 40. C @ 5. min, 2. K/min, 250. C @ 20. min
CapillaryOV-1011151.von Poser, Menut, et al., 199625. m/0.25 mm/0.25 μm, N2, 5. K/min; Tstart: 50. C; Tend: 200. C
CapillaryOV-11139.Bicchi, Frattini, et al., 198823. m/0.32 mm/0.3 μm, H2, 3. K/min; Tstart: 50. C; Tend: 200. C

Kovats' RI, non-polar column, custom temperature program

View large format table.

Column type Active phase I Reference Comment
CapillaryBP-11145.Dwivedi, Khan, et al., 200425. m/0.25 mm/0.25 μm, N2; Program: 60C => 5C/min => 220C(5min) => 3C/min => 245C(5min)
CapillaryHP-51164.Shellie and Marriott, 200330. m/0.25 mm/0.25 μm, He; Program: not specified
CapillaryDB-51164.Rao, Rout, et al., 2000He; Column length: 30. m; Column diameter: 0.25 mm; Program: not specified
CapillaryAT-51177.Rojas and Usubillaga, 200060. m/0.25 mm/0.25 μm, He; Program: 60 C (1 min) 4 K/min -> 200 C 10 K/min -> 280 C
CapillarySF-961156.Malingré and Maarse, 1974Column length: 150. m; Column diameter: 0.75 mm; Program: not specified

Kovats' RI, polar column, isothermal

View large format table.

Column type Active phase Temperature (C) I Reference Comment
CapillaryCarbowax 20M130.1528.Malingré and Maarse, 1974Column length: 150. m; Column diameter: 0.75 mm

Kovats' RI, polar column, temperature ramp

View large format table.

Column type Active phase I Reference Comment
CapillaryHP-Wax1525.Gauvin, Lecomte, et al., 200450. m/0.2 mm/0.4 μm, He, 4. K/min, 230. C @ 30. min; Tstart: 60. C
CapillaryCarbowax 20M1482.Kulkarni, Mallavarapu, et al., 1998N2, 5. K/min; Column length: 25. m; Column diameter: 0.25 mm; Tstart: 60. C; Tend: 200. C
CapillarySupelcowax-20M1453.Bicchi, Frattini, et al., 198823. m/0.32 mm/0.30 μm, H2, 50. C @ 1. min, 3. K/min; Tend: 200. C

Van Den Dool and Kratz RI, non-polar column, temperature ramp

View large format table.

Column type Active phase I Reference Comment
CapillaryHP-51170.Benzo, Gilardoni, et al., 200730. m/0.25 mm/0.25 μm, He, 40. C @ 1. min, 5. K/min, 250. C @ 10. min
CapillaryHP-5MS1165.Vagionas, Ngassapa, et al., 200730. m/0.25 mm/0.25 μm, He, 3. K/min; Tstart: 60. C; Tend: 280. C
CapillaryHP-5MS1158.Kallio, Jussila, et al., 200620. m/0.25 mm/0.25 μm, 60. C @ 4. min, 5. K/min, 240. C @ 15. min
CapillaryHP-5MS1162.Kukic J., Petrovic S., et al., 200630. m/0.25 mm/0.25 μm, He, 3. K/min; Tstart: 60. C; Tend: 280. C
CapillaryCP Sil 5 CB1146.Ziegenbein, Hanssen, et al., 2006H2, 10. K/min; Column length: 25. m; Column diameter: 0.25 mm; Tstart: 80. C; Tend: 270. C
CapillaryDB-51170.Agnihotri, Agarwal, et al., 200530. m/0.25 mm/0.25 μm, He, 90. C @ 2. min, 4. K/min; Tend: 220. C
CapillarySE-541152.Brantner, Pfeifhofer, et al., 200550. m/0.25 mm/0.27 μm, H2, 5. K/min; Tstart: 50. C; Tend: 300. C
CapillaryDB-11133.de Feo, Urrunaga Soria, et al., 200530. m/0.25 mm/0.25 μm, He, 40. C @ 5. min, 2. K/min, 260. C @ 20. min
CapillarySPB-11139.Antunes, Sevinate-Pinto, et al., 200430. m/0.25 mm/0.25 μm, He, 3. K/min, 220. C @ 15. min; Tstart: 70. C
CapillaryRTX-51165.Dugo, Mondello, et al., 200430. m/0.25 mm/0.25 μm, He, 45. C @ 6. min, 3. K/min, 300. C @ 10. min
CapillaryHP-51165.Shellie and Marriott, 200330. m/0.25 mm/0.25 μm, He, 3. K/min; Tstart: 40. C; Tend: 240. C
CapillaryBP-11142.Baldovini, Ristorcelli, et al., 200050. m/0.22 mm/0.25 μm, 2. K/min, 220. C @ 20. min; Tstart: 60. C
CapillaryHP-51148.Kim, Thuy, et al., 200030. m/0.25 mm/0.25 μm, He, 40. C @ 5. min, 2. K/min, 200. C @ 20. min
CapillaryDB-11148.Warthen, Lee, et al., 199725. m/0.2 mm/0.11 μm, He, 5. K/min; Tstart: 50. C; Tend: 250. C
CapillaryDB-11148.Warthen, Lee, et al., 199725. m/0.2 mm/0.11 μm, He, 5. K/min; Tstart: 50. C; Tend: 250. C

Van Den Dool and Kratz RI, non-polar column, custom temperature program

View large format table.

Column type Active phase I Reference Comment
CapillarySE-521167.Bruni, Bianchi, et al., 200730. m/0.32 mm/0.15 μm, He; Program: 45C => 1C/min => 100C => 5C/min => 250C(10min)
CapillaryBPX-51182.Cardeal, da Silva, et al., 200630. m/0.25 mm/0.25 μm; Program: 35C(5min) => 3C/min => 210C => 40C/min => 240C (4min)
CapillarySE-521168.Mondello, Dugo, et al., 199560. m/0.32 mm/0.40 μm, He; Program: 45 C (6 min) 3 C/min -> 111 0C 2 C/min -> 160 C 3 C/min -> 300 C (15 min)

Normal alkane RI, non-polar column, temperature ramp

View large format table.

Column type Active phase I Reference Comment
CapillaryHP-51163.Bertoli, Lepnardi, et al., 201130. m/0.25 mm/0.25 μm, Helium, 3. K/min; Tstart: 60. C; Tend: 240. C
CapillaryHP-5 MS1197.Zarai, Kadri, et al., 201130. m/0.25 mm/0.25 μm, Helium, 30. C @ 3. min, 5. K/min, 250. C @ 10. min
CapillaryHP-51162.Monsef-Esfahani, Miri, et al., 201030. m/0.25 mm/0.25 μm, Helium, 50. C @ 5. min, 3. K/min; Tend: 240. C
CapillaryHP-5 MS1162.Pripdeevech, Chumpolsri, et al., 201030. m/0.25 mm/0.25 μm, Helium, 2. K/min; Tstart: 100. C; Tend: 220. C
CapillaryOV-1011153.Benites, Moiteiro, et al., 200950. m/0.25 mm/0.25 μm, Helium, 2. K/min; Tstart: 70. C; Tend: 220. C
CapillaryDB-5 MS1170.Su, Wang, et al., 200930. m/0.25 mm/0.25 μm, Helium, 40. C @ 2. min, 4. K/min, 250. C @ 2. min
CapillaryDB-51176.Baranauskiene R., Bylaite E., et al., 200750. m/0.32 mm/0.25 μm, He, 50. C @ 2. min, 5. K/min, 280. C @ 10. min
CapillaryCP Sil 5 CB1148.Baran, von Reuss, et al., 200730. m/0.32 mm/0.25 μm, N2, 4. K/min; Tstart: 60. C; Tend: 300. C
CapillaryDB-51141.Coelho, Grosso, et al., 200730. m/0.25 mm/0.25 μm, He, 70. C @ 5. min, 3. K/min, 310. C @ 20. min
CapillaryCP Sil 5 CB1150.Hnawia, Cabalion, et al., 200730. m/0.25 mm/0.25 μm, N2, 5. K/min; Tstart: 50. C; Tend: 200. C
CapillaryHP-51150.Ristic, Krivokuca-Dokic, et al., 200730. m/0.25 mm/0.25 μm, Helium, 4. K/min; Tstart: 40. C; Tend: 260. C
CapillaryHP-5 MS1163.Vagionas, Graikou, et al., 200730. m/0.25 mm/0.25 μm, Helium, 3. K/min; Tstart: 60. C; Tend: 280. C
CapillaryDB-51137.Yadegarinia, Gachkar, et al., 200630. m/0.25 mm/0.25 μm, He, 4. K/min; Tstart: 40. C; Tend: 250. C
CapillaryPE-51185.Singh, Raina, et al., 200530. m/0.32 mm/0.25 μm, H2, 60. C @ 2. min, 5. K/min, 230. C @ 4. min
CapillaryHP-5MS1164.Slavkovska, Couladis, et al., 200530. m/0.25 mm/0.25 μm, He, 3. K/min; Tstart: 60. C; Tend: 280. C
CapillaryHP-5MS1167.Mimica-Dukic, Bozin, et al., 200430. m/0.25 mm/0.25 μm, He, 3. K/min; Tstart: 60. C; Tend: 280. C
CapillaryBPX-51186.Vilaseca, Guy, et al., 200425. m/0.22 mm/1. μm, He, 60. C @ 5. min, 3. K/min, 250. C @ 10. min
CapillaryDB-51176.Edris and Farrag, 2003He, 3. K/min; Column length: 60. m; Column diameter: 0.32 mm; Tstart: 50. C; Tend: 220. C
CapillaryDB-51134.Phatak and Heble, 200230. m/0.25 mm/0.25 μm, He, 70. C @ 3. min, 3. K/min, 250. C @ 2. min
CapillaryBP-11148.Gupta, Mallavarapu, et al., 200130. m/0.25 mm/0.25 μm, N2, 5. K/min; Tstart: 60. C; Tend: 220. C
CapillaryOV-1011142.Orav and Kann, 2001He, 2. K/min; Column length: 50. m; Column diameter: 0.2 mm; Tstart: 50. C; Tend: 250. C
CapillaryHP-51155.Lis-Balchin and Roth, 2000He, 9. K/min, 200. C @ 10. min; Column length: 30. m; Column diameter: 0.25 mm; Tstart: 80. C
CapillaryHP-11132.Lopes, Koketsu, et al., 199925. m/0.32 mm/0.17 μm, H2, 40. C @ 5. min, 3. K/min; Tend: 260. C
CapillaryOV-11151.Oberhofer, Nikiforov, et al., 199925. m/0.25 mm/0.25 μm, H2, 40. C @ 5. min, 3. K/min, 220. C @ 5. min
CapillaryBP-11149.Rao, Bhattacharya, et al., 1999N2, 5. K/min, 220. C @ 10. min; Column length: 25. m; Column diameter: 0.5 mm; Tstart: 60. C
CapillaryDB-51133.Reverchon, Porta, et al., 199730. m/0.25 mm/0.25 μm, He, 50. C @ 5. min, 2. K/min; Tend: 250. C
CapillaryOV-1011143.De Pooter and Schamp, 198630. m/0.5 mm/0.8 μm, He, 2. K/min; Tstart: 40. C; Tend: 220. C
CapillaryOV-1011143.De Pooter and Schamp, 198630. m/0.5 mm/0.8 μm, He, 2. K/min; Tstart: 40. C; Tend: 220. C
CapillarySE-30+Igepal1155.Shibamoto and Jennings, 19771. K/min; Column length: 100. m; Column diameter: 0.25 mm; Tstart: 70. C; Tend: 170. C
CapillarySE-30+Igepal1155.Shibamoto and Jennings, 19771. K/min; Column length: 100. m; Column diameter: 0.25 mm; Tstart: 70. C; Tend: 170. C

Normal alkane RI, non-polar column, custom temperature program

View large format table.

Column type Active phase I Reference Comment
CapillaryDB-11126.Albano, Lima, et al., 201230. m/0.25 mm/0.25 μm, Hydrogen; Program: 45 0C 3 0C/min -> 175 0C 15 0C/min -> 300 0C (10 min)
CapillaryPolydimethyl siloxane with 5 % Ph groups1165.Robinson, Adams, et al., 2012Program: not specified
CapillaryPolydimethyl siloxane with 5 % Ph groups1175.Robinson, Adams, et al., 2012Program: not specified
CapillarySiloxane, 5 % Ph1164.VOC BinBase, 2012Program: not specified
CapillaryPolydimethyl siloxane, 5 % phenyl1164.Skogerson, Wohlgemuth, et al., 2011Program: not specified
CapillaryDB-11155.Delort and Jaquier, 200960. m/0.25 mm/0.25 μm, Helium; Program: 50 0C (5 min) 3 0C/min -> 120 0C 5 0C/min -> 250 0C (3 min) 15 0C/min -> 300 0C (20 min)
CapillaryHP-5 MS1174.Jalali-Heravi, Parastar, et al., 200960. m/0.25 mm/0.25 μm, Helium; Program: 60 0C ( 1 min) 5 0C/min -> 200 0C (1 min) 20 0C/min -> 280 0C (21 min)
CapillaryDB-11126.Mendes, Trindade, et al., 200930. m/0.25 mm/0.25 μm, Hydrogen; Program: 45 0C 3 0C/min -> 175 0C 15 0C/min -> 300 0C (10 min)
CapillaryDB-11126.Mendes, Trindade, et al., 2009, 230. m/0.25 mm/0.25 μm, Hydrogen; Program: 45 0C 3 0C/min -> 175 0C 15 0C/min -> 300 0C (10 min)
CapillaryDB-5 MS1170.Su, Wang, et al., 200930. m/0.25 mm/0.25 μm, Helium; Program: not specified
CapillaryHP-5 MS1163.Formisano, Rigano, et al., 200730. m/0.25 mm/0.25 μm, Helium; Program: 40 0C (5 min) 2 0C/min -> 250 0C (15 min) 10 0C/min -> 270 0C
CapillaryHP-51146.Ristic, Krivokuca-Dokic, et al., 200730. m/0.25 mm/0.25 μm, Helium; Program: not specified
CapillaryDB-11126.Figueiredo A.C., Barroso J.G., et al., 200630. m/0.25 mm/0.25 μm, He; Program: 45C => 3C/min => 175C => 15C/min => 300C (10min)
CapillarySE-521163.Tognolini, Barocelli, et al., 200630. m/0.32 mm/0.15 μm, He; Program: 45C => 1C/min => 100C => 5C/min => 250C (10min)
CapillaryCP Sil 8 CB1163.Radudienë, Judpintienë, et al., 200550. m/0.32 mm/0.25 μm, He; Program: 60C(2min) => 5C/min => 160C(1min) => 10C/min => 250C (3min)
CapillaryDB-51164.Vilaseca, Guy, et al., 2004Program: not specified
CapillarySE-301150.Vinogradov, 2004Program: not specified
CapillaryDB-11126.Baratta, Dorman, et al., 199830. m/0.25 mm/0.25 μm, He; Program: 45C => 3C/min => 175C => 15C/min => 240C (10min)
CapillaryPolydimethyl siloxanes1151.Zenkevich, 1997Program: not specified
CapillaryOV-1011151.Shibamoto, 1987Column length: 60. m; Column diameter: 0.25 mm; Program: not specified
PackedOV-1011151.Swigar and Silverstein, 1981N2, Chromosorb G 60-80mesh DMCS; Column length: 2.5 m; Program: not specified

Normal alkane RI, polar column, temperature ramp

View large format table.

Column type Active phase I Reference Comment
CapillaryHP-Innowax1502.Formisano, Rigano, et al., 200730. m/0.25 mm/0.25 μm, Helium, 40. C @ 5. min, 2. K/min; Tend: 250. C
CapillaryCarbowax 20M1528.Babu and Kaul, 200560. m/0.25 mm/0.25 μm, N2, 40. C @ 2. min, 10. K/min, 190. C @ 15. min
CapillaryPE-Wax1480.Ram, Kumar, et al., 200550. m/0.32 mm/0.25 μm, H2, 4. K/min, 220. C @ 2. min; Tstart: 60. C
CapillaryPEG-20M1489.Orav and Kann, 2001He, 2. K/min; Column length: 50. m; Column diameter: 0.2 mm; Tstart: 70. C; Tend: 220. C
CapillaryInnowax1503.Kaya, Baser, et al., 199960. m/0.25 mm/0.25 μm, He, 60. C @ 10. min; Tend: 220. C
CapillaryHP-Innowax1503.Kaya, Baser, et al., 1999, 260. m/0.25 mm/0.25 μm, He, 60. C @ 10. min; Tend: 220. C
CapillaryBP-201470.Rao, Bhattacharya, et al., 1999N2, 5. K/min; Column length: 25. m; Column diameter: 0.5 mm; Tstart: 60. C; Tend: 200. C
CapillaryHP-Innowax FSC1503.Baser, Kirimer, et al., 1997He, 60. C @ 10. min, 4. K/min, 240. C @ 10. min; Column length: 60. m; Column diameter: 0.25 mm
CapillaryTC-Wax1496.Shuichi, Masazumi, et al., 199680. C @ 5. min, 3. K/min; Column length: 60. m; Column diameter: 0.25 mm; Tend: 240. C
CapillaryCarbowax 20M1468.Shibamoto, 19872. K/min; Column length: 50. m; Column diameter: 0.25 mm; Tstart: 80. C; Tend: 200. C
CapillaryCarbowax 20M1505.Shibamoto and Jennings, 19771. K/min; Column length: 100. m; Column diameter: 0.25 mm; Tstart: 70. C; Tend: 170. C
CapillaryCarbowax 20M1508.Shibamoto and Jennings, 19771. K/min; Column length: 100. m; Column diameter: 0.25 mm; Tstart: 70. C; Tend: 170. C
PackedCarbowax 20M1528.Stancher and Pertoldi, 1967Hydrogen, Gas-Chrom Z (80-100 mesh), 4. K/min; Column length: 2. m; Tstart: 65. C; Tend: 220. C

Normal alkane RI, polar column, custom temperature program

View large format table.

Column type Active phase I Reference Comment
CapillaryInnowax FSC1503.Demirci, Temel, et al., 201160. m/0.25 mm/0.25 μm, Helium; Program: 60 0C (10 min) 4 0C/min -> 220 0C (10 min) 1 0C/min -> 240 0C
CapillaryInnowax1502.Noorizadeh, Farmany, et al., 201160. m/0.25 mm/0.33 μm; Program: not specified
CapillaryCarbowax 20M1495.Vinogradov, 2004Program: not specified
CapillaryHP-Innowax1503.Baser, Demirci, et al., 200260. m/0.25 mm/0.25 μm, He; Program: 60 0C (10 min) 4 K/min -> 220 0C (10 min) 1 K/min -> 240 0C

References

Varming, Andersen, et al., 2006
Varming, C.; Andersen, M.L.; Poll, L., Volatile Monoterpenes in Black Currant (Ribes nigrum L.) Juice: Effects of Heating and Enzymatic Treatment by β-Glucosidase, J. Agric. Food Chem., 2006, 54, 6, 2298-2302, https://doi.org/10.1021/jf051938k . [all data]

Agnihotri, Agarwal, et al., 2005
Agnihotri, V.K.; Agarwal, S.G.; Dhar, P.L.; Thappa, R.K.; Baleshwar; Kapahi, B.K.; Saxena, R.K.; Qazi, G.N., Essential oil composition of Mentha pulegium L. growing wild in the north-western Himalayas India, Flavour Fragr. J., 2005, 20, 6, 607-610, https://doi.org/10.1002/ffj.1497 . [all data]

Baldovini, Ristorcelli, et al., 2000
Baldovini, N.; Ristorcelli, D.; Tomi, F.; Casanova, J., Infraspecific variability of the essential oil of Calamintha nepeta from Corsica (France), Flavour Fragr. J., 2000, 15, 1, 50-54, https://doi.org/10.1002/(SICI)1099-1026(200001/02)15:1<50::AID-FFJ871>3.0.CO;2-F . [all data]

Möllenbeck, König, et al., 1997
Möllenbeck, S.; König, T.; Schreier, P.; Schwab, W.; Rajaonarivony, J.; Ranarivelo, L., Chemical composition and analyses of enantiomers of essential oils from Madagascar, Flavour Fragr. J., 1997, 12, 2, 63-69, https://doi.org/10.1002/(SICI)1099-1026(199703)12:2<63::AID-FFJ614>3.0.CO;2-Z . [all data]

Mondello, Dugo, et al., 1995
Mondello, L.; Dugo, P.; Basile, A.; Dugo, G., Interactive use of linear retention indices, on polar and apolar columns, with a MS-library for reliable identification of complex mixtures, J. Microcolumn Sep., 1995, 7, 6, 581-591, https://doi.org/10.1002/mcs.1220070605 . [all data]