2-Bromo-1,2-dichloro-1,2-difluoro-N,N-bis(trifluoromethyl)ethamine

Phase change data

Data compiled by: William E. Acree, Jr., James S. Chickos

Enthalpy of vaporization

ΔvapH (kJ/mol) Temperature (K) Reference Comment
36.5376.Haszeldine and Tipping, 1965Based on data from 358. - 394. K.

References

Haszeldine and Tipping, 1965
Haszeldine, R.N.; Tipping, A.E., 1145. Perfluoroalkyl derivatives of nitrogen. Part XVII. The reaction of N-bromobistrifluoromethylamine with olefins, J. Chem. Soc., 1965, 6141, https://doi.org/10.1039/jr9650006141 . [all data]