2-Cyclohexen-1-one, 2-hydroxy-3-methyl-6-(1-methylethyl)-

Normal alkane RI, non-polar column, temperature ramp

Data compiled by: NIST Mass Spectrometry Data Center, William E. Wallace, director

Column type CapillaryCapillaryCapillaryCapillaryCapillary
Active phase ZB-1HP-1HP-1ZB-1SPB-Sulfur
Column length (m) 30.50.50.30.30.
Carrier gas Nitrogen  N2He
Substrate
Column diameter (mm) 0.250.20.20.250.32
Phase thickness (μm) 0.250.330.330.254.
Tstart (C) 45.60.60.45.45.
Tend (C) 230.250.250.230.240.
Heat rate (K/min) 3.2.2.3.5.
Initial hold (min)     13.
Final hold (min)  10.10. 5.
I 1273.1277.1246.1273.1309.
ReferenceMierendorff, Stahl-Biskup, et al., 2008Antoniotti, Alezra, et al., 2004Antoniotti, Alezra, et al., 2004Mierendorff, Stahl-Biskup, et al., 2003Mariaca, Berger, et al., 1997
Comment MSDC-RI MSDC-RI MSDC-RI MSDC-RI MSDC-RI

Phase change data

Data compiled as indicated in comments:
AC - William E. Acree, Jr., James S. Chickos

Enthalpy of vaporization

ΔvapH (kJ/mol) Temperature (K) Method Reference Comment
56.2354.AStephenson and Malanowski, 1987Based on data from 339. - 505. K. See also Stull, 1947.; AC

Antoine Equation Parameters

log10(P) = A − (B / (T + C))
    P = vapor pressure (bar)
    T = temperature (K)

View plot Requires a JavaScript / HTML 5 canvas capable browser.

Temperature (K) A B C Reference Comment
339.8 - 505.5.320042506.994-33.907Stull, 1947Coefficents calculated by NIST from author's data.

References

Mierendorff, Stahl-Biskup, et al., 2008
Mierendorff, H.-G.; Stahl-Biskup, E.; Posthumus, M.A.; van Beek, T.A., Composition of commercial Cape chamomile oil (Eriocephalus punctuatus / Eriocephalus tenuifolius), 2008, retrieved from http://www.chemische-analysen-hamburg.de/Publikationen?CapeChamomileOil/. [all data]

Antoniotti, Alezra, et al., 2004
Antoniotti, S.; Alezra, N.; Fernandez, X.; Duñach, E., Catalytic epoxide oxidation: a novel access to flavouring and odorant α-diketones, Flavour Fragr. J., 2004, 19, 5, 373-381, https://doi.org/10.1002/ffj.1371 . [all data]

Mierendorff, Stahl-Biskup, et al., 2003
Mierendorff, H.-G.; Stahl-Biskup, E.; Posthumus, M.A.; van Beek, T.A., Composition of commercial Cape chamomile oil (Eriocephalus punctulatus), Flavour Fragr. J., 2003, 18, 6, 510-514, https://doi.org/10.1002/ffj.1259 . [all data]

Mariaca, Berger, et al., 1997
Mariaca, R.G.; Berger, T.F.H.; Gauch, R.; Imhof, M.I.; Jeangros, B.; Bosset, J.O., Occurrence of volatile mono- and sesquiterpenoids in highland and lowland plant species as possible precursors for flavor compounds in milk and dairy products, J. Agric. Food Chem., 1997, 45, 11, 4423-4434, https://doi.org/10.1021/jf970216t . [all data]