methyl 4-bromobutyrate

Gas phase ion energetics data

Data compiled by: Henry M. Rosenstock, Keith Draxl, Bruce W. Steiner, and John T. Herron

Ionization energy determinations

IE (eV) Method Reference
9.9 ± 0.3EIHowe and Williams, 1968

Appearance energy determinations

Ion AE (eV) Other Products MethodReferenceComment
C4H6OBr+11.2 ± 0.3CH3EIHowe and Williams, 1968

References

Howe and Williams, 1968
Howe, I.; Williams, D.H., Studies in mass spectrometry. XXX. Substituent effects in mass spectrometry. Comparison of charge localization and quasi-equilibrium theories, J. Am. Chem. Soc., 1968, 90, 5461. [all data]