1H-Cyclopropa[a]naphthalene, 1a,2,3,3a,4,5,6,7b-octahydro-1,1,3a,7-tetramethyl-, [1aR-(1aα,3aα,7bα)]-

Normal alkane RI, non-polar column, temperature ramp

Data compiled by: NIST Mass Spectrometry Data Center, William E. Wallace, director

Column type CapillaryCapillaryCapillaryCapillaryCapillary
Active phase HP-5 MSHP-5DB-5CP-Sil 5 CBHP-5MS
Column length (m) 30.30.30.25.30.
Carrier gas HeliumHeliumHeHydrogenHe
Substrate
Column diameter (mm) 0.250.2520.250.250.25
Phase thickness (μm) 0.320.250.250.150.25
Tstart (C) 60.60.50.50.60.
Tend (C) 210.240.250.230.200.
Heat rate (K/min) 6.3.3.3.4.
Initial hold (min) 3.   30.
Final hold (min) 2. 10.
I 1411.1422.1380.1416.1372.
ReferenceTaherpour, Maroofi, et al., 2011Cavar, Maksimovic, et al., 2010Havlik, Kokoska, et al., 2006Olawore, Usman, et al., 2006Gauvin and Smadja, 2005
Comment MSDC-RI MSDC-RI MSDC-RI MSDC-RI MSDC-RI
Column type CapillaryCapillary
Active phase CP Sil 5 CBCP Sil 8 CB
Column length (m) 25.25.
Carrier gas
Substrate
Column diameter (mm) 0.250.20
Phase thickness (μm) 0.15
Tstart (C) 50.60.
Tend (C) 230.230.
Heat rate (K/min) 3.3.
Initial hold (min)  10.
Final hold (min)
I 1413.1418.
ReferenceOgunwande, Olawore, et al., 2005Jantan and Goh, 1990
Comment MSDC-RI MSDC-RI

References

Taherpour, Maroofi, et al., 2011
Taherpour, A.; Maroofi, H.; Changizi, M.; Shoushtari, R.V.; Larijani, K.; Kazempour, A., Chemical compositions of the essential oil and calculation the biophysicochemical coefficients of the components of Hymenocrater longiflorus Benth. of Iran, Natural Sci., 2011, 3, 2, 104-108, https://doi.org/10.4236/ns.2011.32015 . [all data]

Cavar, Maksimovic, et al., 2010
Cavar, S.; Maksimovic, M.; Solic, M.E., Comparison of essential oil composition of Stachys menthufolia Vis. from two natural habitas in Croatia, Biologica Nyssana, 2010, 1, 1-2, 99-103. [all data]

Havlik, Kokoska, et al., 2006
Havlik, J.; Kokoska, L.; Vasickova, S.; Valterova, I., Chemical composition of essential oil from the seeds of Nigella arvensis L. and assessment of its actimicrobial activity, Flavour Fragr. J., 2006, 21, 4, 713-717, https://doi.org/10.1002/ffj.1713 . [all data]

Olawore, Usman, et al., 2006
Olawore, N.O.; Usman, L.A.; Ogunwande, I.A.; Adeleke, K.A., Constituents of rhizome essential oils of two types of Cyperus articulatus L. grown in Nigeria, J. Essent Oil Res., 2006, 18, 6, 604-606, https://doi.org/10.1080/10412905.2006.9699179 . [all data]

Gauvin and Smadja, 2005
Gauvin, A.; Smadja, J., Essential oil composition of four Psiadia species from Reunion Island: A chemotaxonomic study, Biochem. Syst. Ecol., 2005, 33, 7, 705-714, https://doi.org/10.1016/j.bse.2004.12.013 . [all data]

Ogunwande, Olawore, et al., 2005
Ogunwande, I.A.; Olawore, N.O.; Adeleke, K.A.; Ekundayo, O., Volatile constituents from the leaves of Eucalyptus cloeziana F. Muell and E. propinqua Deane Maiden from Nigeria, Flavour Fragr. J., 2005, 20, 6, 637-639, https://doi.org/10.1002/ffj.1516 . [all data]

Jantan and Goh, 1990
Jantan, I.; Goh, S.H., The essential oils of Cinnamomum mollissimum as natural sources of safrole and benzyl benzoate, J. Tropical Forest Sci., 1990, 2, 3, 252-259. [all data]