D-Arabinitol

Phase change data

Data compiled as indicated in comments:
TRC - Thermodynamics Research Center, NIST Boulder Laboratories, Chris Muzny director
AC - William E. Acree, Jr., James S. Chickos

Quantity Value Units Method Reference Comment
Tfus379.4KN/ABarone, DellaGatta, et al., 1990Uncertainty assigned by TRC = 0.2 K; TRC
Quantity Value Units Method Reference Comment
Δsub160.0kJ/molBBarone, Gatta, et al., 1990AC

Enthalpy of vaporization

ΔvapH (kJ/mol) Temperature (K) Method Reference Comment
110.1 ± 1.5440.TEBarone, Gatta, et al., 1990Based on data from 414. - 461. K.; AC

Enthalpy of fusion

ΔfusH (kJ/mol) Temperature (K) Method Reference Comment
38.8376.0DSCCarpentier, Desprez, et al., 2003AC
38.9379.4DSCBarone, Gatta, et al., 1990See also Domalski and Hearing, 1990.; AC

In addition to the Thermodynamics Research Center (TRC) data available from this site, much more physical and chemical property data is available from the following TRC products:

References

Barone, DellaGatta, et al., 1990
Barone, G.; DellaGatta, G.; Ferro, D.; Piacente, V., Enthalpies and entropies of sublimation, vaporization and fusion of nine polyhydric alcohols, J. Chem. Soc., Faraday Trans., 1990, 86, 75. [all data]

Barone, Gatta, et al., 1990
Barone, Guido; Gatta, Giuseppe Della; Ferro, Daniela; Piacente, Vincenzo, Enthalpies and entropies of sublimation, vaporization and fusion of nine polyhydric alcohols, Faraday Trans., 1990, 86, 1, 75, https://doi.org/10.1039/ft9908600075 . [all data]

Carpentier, Desprez, et al., 2003
Carpentier, L.; Desprez, S.; Descamps, M., Journal of Thermal Analysis and Calorimetry, 2003, 73, 2, 577-586, https://doi.org/10.1023/A:1025482230325 . [all data]

Domalski and Hearing, 1990
Domalski, Eugene S.; Hearing, Elizabeth D., Heat Capacities and Entropies of Organic Compounds in the Condensed Phase Volume II, J. Phys. Chem. Ref. Data, 1990, 19, 4, 881, https://doi.org/10.1063/1.555876 . [all data]