Scyllo-Inositol

Kovats' RI, non-polar column, isothermal

View large format table.

Column type Active phase Temperature (C) I Reference Comment
CapillarySPB-1200.2085.Sanz, Villamiel, et al., 200425. m/0.25 mm/0.25 μm, N2

References

Sanz, Villamiel, et al., 2004
Sanz, M.L.; Villamiel, M.; Martinez-Castro, I., Inositols and carbohydrates in different fresh fruit juces, Food Chem., 2004, 87, 3, 325-328, https://doi.org/10.1016/j.foodchem.2003.12.001 . [all data]