Elsholtzia ketone

Normal alkane RI, non-polar column, temperature ramp

View large format table.

Column type Active phase I Reference Comment
CapillaryDB-11178.Xu, Tang, et al., 201030. m/0.25 mm/0.25 μm, Helium, 50. C @ 2. min, 4. K/min, 220. C @ 2. min
CapillaryHP-11167.Senatore, Napolitano, et al., 200430. m/0.25 mm/0.33 μm, He, 40. C @ 5. min, 2. K/min, 260. C @ 20. min

Normal alkane RI, non-polar column, custom temperature program

View large format table.

Column type Active phase I Reference Comment
CapillaryDB-11175.Xu, Tang, et al., 201030. m/0.25 mm/0.25 μm, Helium; Program: not specified
CapillaryCP Sil 5 CB1180.Weyerstahl, Marschall, et al., 1998He; Column length: 25. m; Phase thickness: 0.39 μm; Program: not specified

References

Xu, Tang, et al., 2010
Xu, X.; Tang, Z.; Liang, Y., Comparative analysis of plant essential oils by GC-MS coupled with integrated chemometric resolution methods, Anal. Methods, 2010, 2, 4, 359-367, https://doi.org/10.1039/b9ay00213h . [all data]

Senatore, Napolitano, et al., 2004
Senatore, F.; Napolitano, F.; Mohamed, M.A.-H.; Harris, P.J.C.; MnKeni, P.N.S.; Henderson, J., Antibacterial activity of Tagetes minuta L. (Asteraceae) essential oil with different chemical composition, Flavour Fragr. J., 2004, 19, 6, 574-578, https://doi.org/10.1002/ffj.1358 . [all data]

Weyerstahl, Marschall, et al., 1998
Weyerstahl, P.; Marschall, H.; Weirauch, M.; Thefeld, K.; Surburg, H., Constituents of commercial Labdanum oil, Flavour Fragr. J., 1998, 13, 5, 295-318, https://doi.org/10.1002/(SICI)1099-1026(1998090)13:5<295::AID-FFJ751>3.0.CO;2-I . [all data]