Benzene, 1,2,3-trimethoxy-5-(2-propenyl)-

Van Den Dool and Kratz RI, non-polar column, temperature ramp

Data compiled by: NIST Mass Spectrometry Data Center, William E. Wallace, director

Column type CapillaryCapillaryCapillaryCapillaryCapillary
Active phase HP-5DB-5HP-5MSCP Sil 5 CBHP-5
Column length (m) 30.30.30.30.30.
Carrier gas N2HeHeN2He
Substrate
Column diameter (mm) 0.250.320.250.250.25
Phase thickness (μm) 0.250.250.250.250.25
Tstart (C) 60.40.80.50.60.
Tend (C) 220.250.300.200.260.
Heat rate (K/min) 5.5.4.5.3.
Initial hold (min) 10.2.
Final hold (min)  5.
I 1554.1550.1559.61531.1556.
ReferenceFlamini, Tebano, et al., 2007Wu, Zorn, et al., 2007Zeng, Zhao, et al., 2007Andrianoelisoa H.S., Menut C., et al., 2006Javidnia, Miri, et al., 2005
Comment MSDC-RI MSDC-RI MSDC-RI MSDC-RI MSDC-RI
Column type CapillaryCapillaryCapillaryCapillaryCapillary
Active phase BP-1Optima 5HP-5SE-30HP-1
Column length (m) 50.25.30.25.24.
Carrier gas  HeN2N2He
Substrate
Column diameter (mm) 0.220.250.250.250.32
Phase thickness (μm) 0.250.250.250.250.17
Tstart (C) 60.60.60.60.60.
Tend (C) 220.280.220.180.250.
Heat rate (K/min) 2.3.5.3.4.
Initial hold (min)   10.10.2.
Final hold (min) 20.20. 10.20.
I 1518.1545.1555.1527.1518.
ReferenceGonny, Bradesi, et al., 2004Vérité, Nacer, et al., 2004Flamini, Cioni, et al., 2002bin Jantan, Ayop, et al., 2002Nath, Sarma, et al., 2002
Comment MSDC-RI MSDC-RI MSDC-RI MSDC-RI MSDC-RI
Column type CapillaryCapillaryCapillary
Active phase CP Sil 8 CBMethyl SiliconeBP-1
Column length (m) 50.50.50.
Carrier gas  N2He
Substrate
Column diameter (mm) 0.320.250.22
Phase thickness (μm)  0.170.25
Tstart (C) 60.80.60.
Tend (C) 220.200.220.
Heat rate (K/min) 4.2.2.
Initial hold (min) 5.
Final hold (min) 30. 20.
I 1553.1512.1521.
ReferenceChevance and Farmer, 1999Sumathykutty, Rao, et al., 1999Tam, An, et al., 1998
Comment MSDC-RI MSDC-RI MSDC-RI

Normal alkane RI, non-polar column, temperature ramp

Data compiled by: NIST Mass Spectrometry Data Center, William E. Wallace, director

Column type CapillaryCapillaryCapillaryCapillaryCapillary
Active phase HP-5 MSCP-Sil 5 CBDB-5DB-1HP-5MS
Column length (m) 30.25.30.30.60.
Carrier gas HeliumHeliumHeliumHeliumHelium
Substrate
Column diameter (mm) 0.250.250.320.250.25
Phase thickness (μm) 0.250.150.250.250.25
Tstart (C) 60.50.60.50.70.
Tend (C) 230.220.280.220.250.
Heat rate (K/min) 3. 3.4.3.
Initial hold (min)    2.
Final hold (min)    2.
I 1566.1553.1547.1548.1560.
ReferencePripdeevech and Saansoomchai, 2013Ameen, Usman, et al., 2011Georgiou, Koutsaviti, et al., 2010Xu, Tang, et al., 2010Males, Plazibat, et al., 2009
Comment MSDC-RI MSDC-RI MSDC-RI MSDC-RI MSDC-RI
Column type CapillaryCapillaryCapillaryCapillaryCapillary
Active phase DB-5HP-5DB-5SLB-5 MSHP-5
Column length (m) 30.30.25.30.25.
Carrier gas NitrogenNitrogenNitrogenHeliumHelium
Substrate
Column diameter (mm) 0.250.250.220.250.25
Phase thickness (μm) 0.250.250.250.250.25
Tstart (C) 40.50.50.50.60.
Tend (C) 250.280.300.250.240.
Heat rate (K/min) 3.5.6.53.4.
Initial hold (min) 1.1.2.2.2.
Final hold (min) 10.1.7.10.
I 1557.1562.1512.1546.1554.
ReferenceRahimi-Nasrabadi, Gholivand, et al., 2009Bousaada, Ammar, et al., 2008Chieng, Assim, et al., 2008Lo Presti, Sciarrone, et al., 2008Verdian-rizi, 2008
Comment MSDC-RI MSDC-RI MSDC-RI MSDC-RI MSDC-RI
Column type CapillaryCapillaryCapillaryCapillaryCapillary
Active phase HP-5HP-5 MSHP-5DB-5HP-5
Column length (m) 30.30.30.30.60.
Carrier gas HeliumHeliumHeHeHe
Substrate
Column diameter (mm) 0.250.250.250.250.25
Phase thickness (μm) 0.320.250.320.250.25
Tstart (C) 60.50.60.40.60.
Tend (C) 250.230.250.260.250.
Heat rate (K/min) 5.3.5.4.3.
Initial hold (min) 30.10.30.5.
Final hold (min)  10.
I 1552.1554.1552.1552.1559.
ReferenceYassa and Akhani, 2008Adams, Beauchamp, et al., 2007Yassa and Akhani, 2007Askari and Sefidkon, 2006Bertrand, Comte, et al., 2006
Comment MSDC-RI MSDC-RI MSDC-RI MSDC-RI MSDC-RI
Column type CapillaryCapillaryCapillaryCapillaryCapillary
Active phase DB-1DB-5CP Sil 5 CBDB-1DB-1
Column length (m) 30.30.30.60.25.
Carrier gas HeHeliumN2HeHe
Substrate
Column diameter (mm) 0.250.250.250.250.25
Phase thickness (μm) 0.250.250.25 0.25
Tstart (C) 50.60.60.40.50.
Tend (C) 265.260.300.250.250.
Heat rate (K/min) 2.53.5.4.3.
Initial hold (min) 1. 4. 3.
Final hold (min) 20.
I 1512.1555.1520.1512.1531.
ReferenceIranshahi, Amin, et al., 2006Javidnia, Miri, et al., 2006Kurowska and Galazka, 2006Sefidkon, Jamzad, et al., 2006Cégiéla-Carlioz, Bessière, et al., 2005
Comment MSDC-RI MSDC-RI MSDC-RI MSDC-RI MSDC-RI
Column type CapillaryCapillaryCapillaryCapillaryCapillary
Active phase DB-5CP Sil 8 CBHP-5SE-54DB-1
Column length (m) 30.30.30.30.60.
Carrier gas HeHeHeliumHeHe
Substrate
Column diameter (mm) 0.250.250.320.250.32
Phase thickness (μm)   0.250.250.25
Tstart (C) 40.60.40.60.35.
Tend (C) 240.290.300.260.230.
Heat rate (K/min) 4.3.4.2.2.
Initial hold (min)  5. 5.4.
Final hold (min)   5. 25.
I 1552.1554.1546.1545.1515.
ReferenceSefidkon and Jamzad, 2005Suárez, Vásquez, et al., 2005Utsunomia, Kawata, et al., 2005Kilic, Hafizoglu, et al., 2004Park, Lee, et al., 2004
Comment MSDC-RI MSDC-RI MSDC-RI MSDC-RI MSDC-RI
Column type CapillaryCapillaryCapillaryCapillaryCapillary
Active phase DB-1DB-1DB-1OV-101DB-1
Column length (m) 60.60.60.50.50.
Carrier gas HeHeHeHeN2
Substrate
Column diameter (mm) 0.320.320.320.20.25
Phase thickness (μm) 0.250.250.250.50.25
Tstart (C) 35.35.35.50.90.
Tend (C) 230.230.230.250.240.
Heat rate (K/min) 2.2.2.2.4.
Initial hold (min) 4.4.4.
Final hold (min) 25.25.25.
I 1516.1516.1517.1526.1517.
ReferencePark, Lee, et al., 2004Park, Lee, et al., 2004Park, Lee, et al., 2004Orav, Kailas, et al., 2003Velasco-Negueruela, Pérez-Alonso, et al., 2003
Comment MSDC-RI MSDC-RI MSDC-RI MSDC-RI MSDC-RI
Column type CapillaryCapillaryCapillaryCapillaryCapillary
Active phase HP-5DB-5RSL-200DB-5SPB-1
Column length (m) 30.30.30.30.50.
Carrier gas HeHeH2He
Substrate
Column diameter (mm) 0.250.250.320.250.2
Phase thickness (μm) 0.320.250.250.250.33
Tstart (C) 60.60.40.60.60.
Tend (C) 250.280.280.270.260.
Heat rate (K/min) 5.3.6.3.4.
Initial hold (min) 30. 5.
Final hold (min)  30.5.
I 1560.1540.1514.1558.1512.
ReferenceYassa, Akhani, et al., 2003Caredda, Marongiu, et al., 2002Jirovetz, Buchbauer, et al., 2002Palmeira, Conserva, et al., 2001Choo, Wong, et al., 1999
Comment MSDC-RI MSDC-RI MSDC-RI MSDC-RI MSDC-RI
Column type CapillaryCapillaryCapillaryCapillaryCapillary
Active phase DB-1DB-1DB-1DB-1DB-1
Column length (m) 30.30.30.30.30.
Carrier gas HeHeHeHeHe
Substrate
Column diameter (mm) 0.250.250.250.250.25
Phase thickness (μm)  0.250.250.250.25
Tstart (C) 70.50.50.50.50.
Tend (C) 300.240.240.240.240.
Heat rate (K/min) 3.3.3.5.5.
Initial hold (min) 5.5.5.3.3.
Final hold (min)
I 1515.1519.1530.1530.1531.
ReferenceGuy and Vernin, 1996Shiota, 1993Shiota, 1993Shiota, 1993Shiota, 1993
Comment MSDC-RI MSDC-RI MSDC-RI MSDC-RI MSDC-RI

References

Flamini, Tebano, et al., 2007
Flamini, G.; Tebano, M.; Cioni, P.L.; Ceccarini, L.; Ricci, A.S.; Longo, I., Comparison between the conventional method of extraction of essential oil of Laurus nobilis L. and a novel method which uses microwaves applied in situ, without resorting to an oven, J. Chromatogr. A, 2007, 1143, 1-2, 36-40, https://doi.org/10.1016/j.chroma.2007.01.031 . [all data]

Wu, Zorn, et al., 2007
Wu, S.; Zorn, H.; Krings, U.; Berger, R.G., Volatiles from submerged and surface-cultured beefsteak fungus, Fistulina hepatica, Flavour Fragr. J., 2007, 22, 1, 53-60, https://doi.org/10.1002/ffj.1758 . [all data]

Zeng, Zhao, et al., 2007
Zeng, Y.-X.; Zhao, C.-X.; Liang, Y.-Z.; Yang, H.; Fang, H.-Z.; Yi, L.-Z.; Zeng, Z.-D., Comparative analysis of volatile components from Clematis species growing in China, Anal. Chim. Acta., 2007, 595, 1-2, 328-339, https://doi.org/10.1016/j.aca.2006.12.022 . [all data]

Andrianoelisoa H.S., Menut C., et al., 2006
Andrianoelisoa H.S.; Menut C.; de Chatelperron P.C.; Saracco J.; Ramanoelina P.; Danthu P., Intraspecific chemical variability and highlighting of chemotypes of leaf essential oils from Ravensara aromatica Sonnerat a tree endemic to Madagascar, Flavour Fragr. J., 2006, 21, 5, 833-838, https://doi.org/10.1002/ffj.1735 . [all data]

Javidnia, Miri, et al., 2005
Javidnia, K.; Miri, R.; Kamalinejad, M.; Edraki, N., Chemical composition of Ferula persica Wild. essential oil from Iran, Flavour Fragr. J., 2005, 20, 6, 605-606, https://doi.org/10.1002/ffj.1496 . [all data]

Gonny, Bradesi, et al., 2004
Gonny, M.; Bradesi, P.; Casanova, J., Identification of the components of the essential oil from wild Corsican Daucus carota L. using 13C-NMR spectroscopy, Flavour Fragr. J., 2004, 19, 5, 424-433, https://doi.org/10.1002/ffj.1330 . [all data]

Vérité, Nacer, et al., 2004
Vérité, P.; Nacer, A.; Kabouche, Z.; Seguin, E., Composition of seeds and stems essential oils of Pituranthos scoparius (Coss. Dur.) Schinz, Flavour Fragr. J., 2004, 19, 6, 562-564, https://doi.org/10.1002/ffj.1353 . [all data]

Flamini, Cioni, et al., 2002
Flamini, G.; Cioni, P.L.; Morelli, I., Differences in the fragrances of pollen and different floral parts of male and female flowers of Laurus nobilis, J. Agric. Food Chem., 2002, 50, 16, 4647-4652, https://doi.org/10.1021/jf020269x . [all data]

bin Jantan, Ayop, et al., 2002
bin Jantan, I.; Ayop, N.; Hiong, A.B.; Ahmad, A.S., Chemical composition of the essential oils of Cinnamomum cordatum Kosterm, Flavour Fragr. J., 2002, 17, 3, 212-214, https://doi.org/10.1002/ffj.1075 . [all data]

Nath, Sarma, et al., 2002
Nath, S.C.; Sarma, K.K.; Vajezikova, I.; Leclercq, P.A., Comparison of volatile inflorescence oils and taxonomy of certain Cymbopogon taxa described as Cymbopogon flexuosus (Nees ex Steud.) Wats., Biochem. Syst. Ecol., 2002, 30, 2, 151-162, https://doi.org/10.1016/S0305-1978(01)00066-7 . [all data]

Chevance and Farmer, 1999
Chevance, F.F.V.; Farmer, L.J., Identification of major volatile odor compounds in frankfurters, J. Agric. Food Chem., 1999, 47, 12, 5151-5160, https://doi.org/10.1021/jf990515d . [all data]

Sumathykutty, Rao, et al., 1999
Sumathykutty, M.A.; Rao, J.M.; Padmakumari, K.P.; Narayanan, C.S., Essential oil constituents of some Piper species, Flavour Fragr. J., 1999, 14, 5, 279-282, https://doi.org/10.1002/(SICI)1099-1026(199909/10)14:5<279::AID-FFJ821>3.0.CO;2-0 . [all data]

Tam, An, et al., 1998
Tam, N.T.; An, H.L.; Muselli, a.; Bighelli, A.; Casanova, J., Essential oil of an unidentified Illicium species from Ninh Binh Province, Vietnam, Flavour Fragr. J., 1998, 13, 6, 393-396, https://doi.org/10.1002/(SICI)1099-1026(199811/12)13:6<393::AID-FFJ764>3.0.CO;2-R . [all data]