α-Isolupanine

Normal alkane RI, non-polar column, custom temperature program

Data compiled by: NIST Mass Spectrometry Data Center, William E. Wallace, director

Column type CapillaryCapillaryCapillaryCapillaryCapillary
Active phase DB-5 MSDB-1DB-1DB-1DB-1
Column length (m) 30.15.15.30.30.
Carrier gas  HeliumHeHeHe
Substrate
Column diameter (mm) 0.250.3170.250.320.32
Phase thickness (μm)
Program 100 0C (1 min) 40 0C/min -> 200 0C 5 0C/min -> 275 0C (15 min)150 0C (2 min) 15 0C/min -> 250 0C 25 0C/min -> 300 0C (5 min)150C(2min) => 10C/min => 250C => 20C/min => 300C (10min)150C (2min) => 10C/min => 250C => 20C/min => 300C (5min)150C (2min) => 10C/min => 250C => 20C/min => 300C (5min)
I 2091.2105.2100.2105.2105.
ReferenceCook, Lee, et al., 2009El-Shazly, Ateya, et al., 2001Greinwald, Ross, et al., 1996Greinwald, van Rensen, et al., 1995Greinwald, Ross, et al., 1995
Comment MSDC-RI MSDC-RI MSDC-RI MSDC-RI MSDC-RI
Column type CapillaryCapillary
Active phase DB-1DB-1
Column length (m) 30.30.
Carrier gas  He
Substrate
Column diameter (mm) 0.30.32
Phase thickness (μm)
Program not specified150C (2min) => 10C/min => 250C => 20C/min => 300C (5min)
I 2105.2105.
ReferenceWink, Meissner, et al., 1995Greinwald, Witte, et al., 1991
Comment MSDC-RI MSDC-RI

References

Cook, Lee, et al., 2009
Cook, D.; Lee, S.T.; GArdner, D.R.; Pfister, J.A.; Welch, K.D.; Green, B.T.; Davis, T.Z.; Panter, K.E., The alkaloids profiles of lupinus sulphureus, J. Agric. Food Chem., 2009, 57, 4, 1646-1653, https://doi.org/10.1021/jf803468q . [all data]

El-Shazly, Ateya, et al., 2001
El-Shazly, A.; Ateya, A.-M.M.; Wink, M., Quinolizidine alkaloid profiles of lupunus varius orientalis. L. albus albus, L. hartwegii, and L. densiflorus, Z. Naturforsch., 2001, 56c, 21-30. [all data]

Greinwald, Ross, et al., 1996
Greinwald, R.; Ross, J.H.; Witte, L.; Czygan, F.-C., Alkaloids of Templetonia incana, Biochem. Syst. Ecol., 1996, 24, 5, 423-426, https://doi.org/10.1016/0305-1978(96)00024-5 . [all data]

Greinwald, van Rensen, et al., 1995
Greinwald, R.; van Rensen, I.; Veit, M.; Canto, P.; Witte, L., A chemical dichotomy in quinolizidine alkaloid accumulation within the section Spartioides of the genus Genista (Fabaceae: Genisteae), Biochem. Syst. Ecol., 1995, 23, 1, 89-97, https://doi.org/10.1016/0305-1978(95)93662-M . [all data]

Greinwald, Ross, et al., 1995
Greinwald, R.; Ross, J.H.; Witte, L.; Czygan, F.-C., The alkaloid pattern of Plagiocarpus axillaris (Fabaceae: Brongniartieae), Biochem. Syst. Ecol., 1995, 23, 6, 645-648, https://doi.org/10.1016/0305-1978(95)00059-3 . [all data]

Wink, Meissner, et al., 1995
Wink, M.; Meissner, C.; Witte, L., Patterns of quinolizidine alkaloids in 56 species of the genus Lupinus, Phytochemistry, 1995, 38, 1, 139-153, https://doi.org/10.1016/0031-9422(95)91890-D . [all data]

Greinwald, Witte, et al., 1991
Greinwald, R.; Witte, L.; Wray, V.; Czygan, F.-C., The alkaloid pattern of Cytisophyllum sessilitolium (Fabaceae-Genisteae), Biochem. Syst. Ecol., 1991, 19, 3, 253-258, https://doi.org/10.1016/0305-1978(91)90010-W . [all data]