2H-Quinolizine-1-methanol, octahydro-, (1R-trans)-

Normal alkane RI, non-polar column, custom temperature program

Data compiled by: NIST Mass Spectrometry Data Center, William E. Wallace, director

Column type CapillaryCapillaryCapillaryCapillary
Active phase DB-1DB-1DB-1DB-1
Column length (m) 15.15.30.30.
Carrier gas HeliumHeHe
Substrate
Column diameter (mm) 0.3170.250.320.3
Phase thickness (μm)
Program 150 0C (2 min) 15 0C/min -> 250 0C 25 0C/min -> 300 0C (5 min)150C(2min) => 10C/min => 250C => 20C/min => 300C (10min)150C (2min) => 10C/min => 250C => 20C/min => 300C (5min)not specified
I 1422.1420.1420.1420.
ReferenceEl-Shazly, Ateya, et al., 2001Greinwald, Ross, et al., 1996Greinwald, Ross, et al., 1995Wink, Meissner, et al., 1995
Comment MSDC-RI MSDC-RI MSDC-RI MSDC-RI

References

El-Shazly, Ateya, et al., 2001
El-Shazly, A.; Ateya, A.-M.M.; Wink, M., Quinolizidine alkaloid profiles of lupunus varius orientalis. L. albus albus, L. hartwegii, and L. densiflorus, Z. Naturforsch., 2001, 56c, 21-30. [all data]

Greinwald, Ross, et al., 1996
Greinwald, R.; Ross, J.H.; Witte, L.; Czygan, F.-C., Alkaloids of Templetonia incana, Biochem. Syst. Ecol., 1996, 24, 5, 423-426, https://doi.org/10.1016/0305-1978(96)00024-5 . [all data]

Greinwald, Ross, et al., 1995
Greinwald, R.; Ross, J.H.; Witte, L.; Czygan, F.-C., The alkaloid pattern of Plagiocarpus axillaris (Fabaceae: Brongniartieae), Biochem. Syst. Ecol., 1995, 23, 6, 645-648, https://doi.org/10.1016/0305-1978(95)00059-3 . [all data]

Wink, Meissner, et al., 1995
Wink, M.; Meissner, C.; Witte, L., Patterns of quinolizidine alkaloids in 56 species of the genus Lupinus, Phytochemistry, 1995, 38, 1, 139-153, https://doi.org/10.1016/0031-9422(95)91890-D . [all data]