Isoquinoline, 1-[(3,4-diethoxyphenyl)methyl]-6,7-diethoxy-

Normal alkane RI, non-polar column, temperature ramp

Data compiled by: NIST Mass Spectrometry Data Center, William E. Wallace, director

Column type CapillaryPackedPacked
Active phase Polymethylsiloxane, (PMS-20000)OV-1SE-30
Column length (m) 12.2.2.
Carrier gas He
Substrate  Gas Chrom PGas Chrom P
Column diameter (mm) 0.20
Phase thickness (μm) 0.33
Tstart (C) 160.150.150.
Tend (C) 300.300.300.
Heat rate (K/min) 10.5.5.
Initial hold (min)
Final hold (min)
I 2935.2975.2945.
ReferenceGambaro, Saligari, et al., 1997Marozzi, Gambaro, et al., 1982Marozzi, Gambaro, et al., 1982
Comment MSDC-RI MSDC-RI MSDC-RI

References

Gambaro, Saligari, et al., 1997
Gambaro, V.; Saligari, E.; Froldi, R.; Bianchi, L., Analysis of street drugs by means of HRGC, Bollettino Chimico Farmaceutica, 1997, 36, 4, 359-367. [all data]

Marozzi, Gambaro, et al., 1982
Marozzi, E.; Gambaro, V.; Saligari, E.; Mariani, R.; Lodi, F., Use of the retention index in gas chromatographic studies of drugs, J. Anal. Toxicol., 1982, 6, 4, 185-192, https://doi.org/10.1093/jat/6.4.185 . [all data]