3-Octanol, acetate

Normal alkane RI, polar column, temperature ramp

Data compiled by: NIST Mass Spectrometry Data Center, William E. Wallace, director

Column type CapillaryCapillary
Active phase DB-WaxInnowax
Column length (m) 30.60.
Carrier gas HeliumHe
Substrate
Column diameter (mm) 0.250.25
Phase thickness (μm) 0.250.25
Tstart (C) 60.60.
Tend (C) 250.220.
Heat rate (K/min) 10.
Initial hold (min) 2.10.
Final hold (min) 10.
I 1344.1345.
ReferenceGuo, Wu, et al., 2008Kaya, Baser, et al., 1999
Comment MSDC-RI MSDC-RI

Kovats' RI, non-polar column, temperature ramp

Data compiled by: NIST Mass Spectrometry Data Center, William E. Wallace, director

Column type CapillaryCapillaryCapillaryCapillary
Active phase DB-5DB-5OV-101OV-101
Column length (m) 30.30.50.50.
Carrier gas HeHe
Substrate
Column diameter (mm) 0.250.250.230.23
Phase thickness (μm) 0.250.25
Tstart (C) 40.40.80.80.
Tend (C) 250.250.200.200.
Heat rate (K/min) 2.2.2.2.
Initial hold (min) 5.5.
Final hold (min) 20.20.
I 1102.1102.1110.1110.
ReferenceSenatore, Urrunaga Soria, et al., 1998Senatore, 1998Ohnishi and Shibamoto, 1984Ohnishi and Shibamoto, 1984
Comment MSDC-RI MSDC-RI MSDC-RI MSDC-RI

References

Guo, Wu, et al., 2008
Guo, L.; Wu, J.-Z.; Han, T.; Cao, T.; Rahman, K.; Qin, L.-P., Chemical composition, antifungal and antitumor properties of ether extracts of Scapania verrucosa Heeg. and its endophytic fungus Chaetomium fusiforme, Molecules, 2008, 13, 9, 2114-2125, https://doi.org/10.3390/molecules13092114 . [all data]

Kaya, Baser, et al., 1999
Kaya, A.; Baser, K.H.C.; Demirci, B.; Koca, F., The essential oil of Acinos alpinus (L.) Moench growing in Turkey, Flavour Fragr. J., 1999, 14, 1, 55-59, https://doi.org/10.1002/(SICI)1099-1026(199901/02)14:1<55::AID-FFJ784>3.0.CO;2-Q . [all data]