Iridomyrmecin

Van Den Dool and Kratz RI, non-polar column, temperature ramp

View large format table.

Column type Active phase I Reference Comment
CapillaryHP-51463.Zhao, Wang X.Y., et al., 200630. m/0.25 mm/0.25 μm, He, 50. C @ 3. min, 10. K/min; Tend: 260. C

Normal alkane RI, non-polar column, custom temperature program

View large format table.

Column type Active phase I Reference Comment
PackedOV-1011400.Swigar and Silverstein, 1981N2, Chromosorb G 60-80mesh DMCS; Column length: 2.5 m; Program: not specified
PackedOV-1011422.Swigar and Silverstein, 1981N2, Chromosorb G 60-80mesh DMCS; Column length: 2.5 m; Program: not specified

References

Zhao, Wang X.Y., et al., 2006
Zhao, Y.P.; Wang X.Y.; Wang, Z.C.; Lu Y.; Fu, C.X.; Chen, S.Y., Essential oil of Actinidia macrosperma, a catnip response kiwi endemic to China, Journal of Zhejiang University SCIENCE B, 2006, 7, 9, 708-712, https://doi.org/10.1631/jzus.2006.B0708 . [all data]

Swigar and Silverstein, 1981
Swigar, A.A.; Silverstein, R.M., Monoterpenes, Aldrich Chemical Company, Milwaukee, WI, USA, 1981, 130. [all data]