1,3-Benzodioxole, 4,5-dimethoxy-6-(2-propenyl)-

Normal alkane RI, non-polar column, custom temperature program

Data compiled by: NIST Mass Spectrometry Data Center, William E. Wallace, director

Column type CapillaryCapillaryCapillaryCapillaryCapillary
Active phase DB-5HP-5 MSElite-5 MSHP-5 MSHP-5MS
Column length (m) 30.30.30.30.30.
Carrier gas HydrogenHeliumHeliumHeliumHe
Substrate
Column diameter (mm) 0.250.250.250.250.25
Phase thickness (μm) 0.250.250.250.250.25
Program 35 0C (2 min) 4 0C/min -> 180 0C 20 0C/min -> 280 0C50 0C (3 min) 3 0C/min -> 160 0C (10 min) 3 0C/min -> 240 0C60 0C (1 min) 1.5 0C/min -> 185 0C (1 min) 9 0C/min -> 275 0C (2 min)not specified60C => 1.5C/min => 185C(1min) => 9C/min => 275C(2min)
I 1620.1631.1612.1610.1622.
ReferencePontes, Silva, et al., 2010Sharifiar, Yassa, et al., 2010Kapoor, Singh, et al., 2009Sharififar, Mozaffarian, et al., 2007Singh, Marimuthu, et al., 2006
Comment MSDC-RI MSDC-RI MSDC-RI MSDC-RI MSDC-RI
Column type CapillaryCapillary
Active phase SE-30DB-5
Column length (m)  30.
Carrier gas  He
Substrate
Column diameter (mm)  0.25
Phase thickness (μm)  0.25
Program not specified40C => 2C/min => 60C => 4C/min => 260C
I 1595.1621.
ReferenceVinogradov, 2004Andrade, Maia, et al., 2000
Comment MSDC-RI MSDC-RI

Normal alkane RI, polar column, custom temperature program

Data compiled by: NIST Mass Spectrometry Data Center, William E. Wallace, director

Column type CapillaryCapillaryCapillaryCapillary
Active phase HP-Innowax FSCInnowax FSCCarbowax 20MInnowax
Column length (m) 60.60. 60.
Carrier gas  He He
Substrate
Column diameter (mm) 0.250.25 0.25
Phase thickness (μm) 0.250.25 0.25
Program 60C(10min) => 4C/min => 220C (10min) => 1C/min => 240C60C(10min) => 4C/min => 220C(10min) => 1C/min => 240Cnot specified60C(10min) => 4C/min => 200C(10min) => 1C/min => 240C
I 2384.2384.2370.2384.
ReferenceTabanca, Demirci, et al., 2006Kosar, Özek, et al., 2005Vinogradov, 2004Özcan, Akgül, et al., 2001
Comment MSDC-RI MSDC-RI MSDC-RI MSDC-RI

References

Pontes, Silva, et al., 2010
Pontes, W.J.T.; Silva, J.M.O.; ds Camara, C.A.G.; Gondim-Junior, M.G.C.; Oliveira, J.V., Chemical composition and acaricidal activity of the essential oils from fruits and leaves of Protium bahianum Daly, J. Essential Oil Res., 2010, 22, 3, 279-282, https://doi.org/10.1080/10412905.2010.9700324 . [all data]

Sharifiar, Yassa, et al., 2010
Sharifiar, F.; Yassa, N.; Mozaffarian, V., Bioactivity of major components from the seeds of Bunium persicum (Boiss.) Fedtch, Pakistan J. Pharm. Sci., 2010, 23, 3, 300-304. [all data]

Kapoor, Singh, et al., 2009
Kapoor, I.; Singh, B.; Singh, G.; De Heluani, C.S.; De Lampasona, M.P.; Catalan, C.A.N., Chemistry and in vitro antioxidant activity of volatile oil and oleoresins of black pepper (Piper nigrum), J. Agric. Food Chem., 2009, 57, 12, 5358-5364, https://doi.org/10.1021/jf900642x . [all data]

Sharififar, Mozaffarian, et al., 2007
Sharififar, F.; Mozaffarian, V.; Moradkhani, S., Comparison of antioxidant and free radical scavenging activities of the essential oils from flowers and fruits of Otostegia persica Boiss., Pakistan J. Biol. Sci., 2007, 10, 21, 3895-3899, https://doi.org/10.3923/pjbs.2007.3895.3899 . [all data]

Singh, Marimuthu, et al., 2006
Singh, G.; Marimuthu, P.; de Heluani, C.S.; Catalan, C.A.N., Antioxidant and biocidal activities of Carum nigrum (seed) essential oil, oleoresin, and their selected components, J. Agric. Food Chem., 2006, 54, 1, 174-181, https://doi.org/10.1021/jf0518610 . [all data]

Vinogradov, 2004
Vinogradov, B.A., Production, composition, properties and application of essential oils, 2004, retrieved from http://viness.narod.ru. [all data]

Andrade, Maia, et al., 2000
Andrade, E.H.A.; Maia, J.G.S.; Zoghbi, M.G.B., Aroma volatile constituents of Brazilian varieties of mango fruit, J. Food Comp. Anal., 2000, 13, 1, 27-33, https://doi.org/10.1006/jfca.1999.0841 . [all data]