Naphthalene, 1,2,3,5,6,8a-hexahydro-4,7-dimethyl-1-(1-methylethyl)-, (1S-cis)-

Normal alkane RI, non-polar column, temperature ramp

Data compiled by: NIST Mass Spectrometry Data Center, William E. Wallace, director

Column type CapillaryCapillaryCapillaryCapillaryCapillary
Active phase RTX-5 MSDB-5HP-5 MSRTX-1RTX-1
Column length (m) 30.30.60.60.60.
Carrier gas HeliumHeliumHeliumHeliumHelium
Substrate
Column diameter (mm) 0.250.250.250.220.22
Phase thickness (μm)  0.250.250.250.25
Tstart (C) 60.60.40.60.60.
Tend (C) 240.240.250.230.230.
Heat rate (K/min) 3.3.3.2.2.
Initial hold (min)   1.
Final hold (min)   20.5.5.
I 1531.1523.1498.1520.1520.
ReferencePinheiro, de Queiros, et al., 2013Rodriques, Amorim, et al., 2013Sardashti, Valizadeh, et al., 2013Bendiabdellah, El Amine Dib, et al., 2012Bendiabdellah, El Amine Dib, et al., 2012
Comment MSDC-RI MSDC-RI MSDC-RI MSDC-RI MSDC-RI
Column type CapillaryCapillaryCapillaryCapillaryCapillary
Active phase DB-5HP-5 MSHP-5 MSHP-5HP-5
Column length (m) 30.30.30.25.25.
Carrier gas HeliumHeliumHeliumHydrogenHydrogen
Substrate
Column diameter (mm) 0.250.250.250.320.32
Phase thickness (μm) 0.250.250.250.520.52
Tstart (C) 100.40.50.40.40.
Tend (C) 260.250.180.280.280.
Heat rate (K/min) 10.3.2.4.4.
Initial hold (min) 1.1.
Final hold (min) 10.3. 10.10.
I 1528.1522.1523.1518.1518.
ReferenceBoukhris, Bouaziz, et al., 2012Jian-Yu, Zhu, et al., 2012Phungpanya, Thongpoon, et al., 2012Velickovic, Ristic, et al., 2012Velickovic, Ristic, et al., 2012
Comment MSDC-RI MSDC-RI MSDC-RI MSDC-RI MSDC-RI
Column type CapillaryCapillaryCapillaryCapillaryCapillary
Active phase HP-5HP-5 MSRTX-1HP-5 MSHP-5
Column length (m) 25.30.60.30.30.
Carrier gas Hydrogen HeliumHeliumHelium
Substrate
Column diameter (mm) 0.320.250.220.250.25
Phase thickness (μm) 0.520.250.250.250.25
Tstart (C) 40.60.60.50.60.
Tend (C) 280.300.230.250.240.
Heat rate (K/min) 4.15.2.7.3.
Initial hold (min)  2. 1.
Final hold (min) 10.10.45.5.
I 1518.1525.1509.1518.1523.
ReferenceVelickovic, Ristic, et al., 2012Xu, Han, et al., 2012Yapi, Boti, et al., 2012Zouari, Ayadi, et al., 2012Bertoli, Lepnardi, et al., 2011
Comment MSDC-RI MSDC-RI MSDC-RI MSDC-RI MSDC-RI
Column type CapillaryCapillaryCapillaryCapillaryCapillary
Active phase HP-5 MSHP-5DB-5VF-5 MSVF-5 MS
Column length (m) 30.30.30.60.60.
Carrier gas HeliumHeliumHeliumHeliumHelium
Substrate
Column diameter (mm) 0.250.320.250.320.32
Phase thickness (μm) 0.250.250.250.250.25
Tstart (C) 60.60.60.30.30.
Tend (C) 220.240.240.260.260.
Heat rate (K/min) 4.3.3.2.2.
Initial hold (min) 20.2.
Final hold (min) 20.  28.28.
I 1517.1525.1524.1522.1522.
ReferenceFeizbakhsh and Naeemy, 2011Kahriman, Tosun, et al., 2011Karimi, Farmani, et al., 2011Leffingwell and Alford, 2011Leffingwell and Alford, 2011
Comment MSDC-RI MSDC-RI MSDC-RI MSDC-RI MSDC-RI
Column type CapillaryCapillaryCapillaryCapillaryCapillary
Active phase SE-30 MSCP-Sil 5 CBDB-5RTX-5ZB-5
Column length (m) 30.30.30.30.30.
Carrier gas HeliumNitrogenHeliumNitrogenNitrogen
Substrate
Column diameter (mm) 0.250.250.320.320.25
Phase thickness (μm) 0.250.260.250.250.25
Tstart (C) 50.45.50.60.40.
Tend (C) 250.280.300.210.200.
Heat rate (K/min) 5.3.4.3.5.
Initial hold (min) 5. 4. 5.
Final hold (min) 10.22.5.
I 1524.1518.1509.1520.1533.
ReferenceMenichini, Tundis, et al., 2011Mothana, Hasson, et al., 2011Osorio, Carriazo, et al., 2011Prasad, Moulekhi, et al., 2011Vazques, Aimar, et al., 2011
Comment MSDC-RI MSDC-RI MSDC-RI MSDC-RI MSDC-RI
Column type CapillaryCapillaryCapillaryCapillaryCapillary
Active phase ZB-5HP-5 MSElite-5 MSHP-5ZB-5 MS
Column length (m) 30.30.30.30.30.
Carrier gas NitrogenHeliumHeliumHeliumHelium
Substrate
Column diameter (mm) 0.250.250.250.250.25
Phase thickness (μm) 0.250.250.250.250.25
Tstart (C) 40.30.40.50.60.
Tend (C) 200.250.220.300.290.
Heat rate (K/min) 5.5.4.50.5.
Initial hold (min) 5.3. 5.
Final hold (min) 5.10. 5.
I 1533.1559.1496.1520.1519.
ReferenceVazquez, Demmel, et al., 2011Zarai, Kadri, et al., 2011Baharum, Bunawan, et al., 2010Bi Kouame, Bedi, et al., 2010Boix, Victorio, et al., 2010
Comment MSDC-RI MSDC-RI MSDC-RI MSDC-RI MSDC-RI
Column type CapillaryCapillaryCapillaryCapillaryCapillary
Active phase HP-5RTX-1DB-5SPB-1BP-1
Column length (m) 30.60.30.30.
Carrier gas HeliumHeliumHeliumHeliumNitrogen
Substrate
Column diameter (mm) 0.2520.220.250.25
Phase thickness (μm) 0.250.250.250.25
Tstart (C) 60.60.50.50.60.
Tend (C) 240.230.250.250.220.
Heat rate (K/min) 3.2.2.5.5.
Initial hold (min)    3.10.
Final hold (min)  30. 15.30.
I 1522.1520.1523.1498.1516.
ReferenceCavar, Maksimovic, et al., 2010Dib, Djabou, et al., 2010Ho, Wang, et al., 2010Lazarevic, Palic, et al., 2010Mishra, Chaudhary, et al., 2010
Comment MSDC-RI MSDC-RI MSDC-RI MSDC-RI MSDC-RI
Column type CapillaryCapillaryCapillaryCapillaryCapillary
Active phase HP-5HP-5HP-5 MSHP-5 MSHP-5 MS
Column length (m) 30.30.30.30.30.
Carrier gas HeliumHeliumHeliumHeliumHelium
Substrate
Column diameter (mm) 0.250.250.250.250.25
Phase thickness (μm) 0.250.250.250.250.25
Tstart (C) 40.50.60.60.70.
Tend (C) 260.240.220.220.290.
Heat rate (K/min) 4.3.5.5.5.
Initial hold (min)  5.10.10.
Final hold (min) 5.   10.
I 1529.1492.1525.1525.1521.
ReferenceMiyazawa, Kawauchi, et al., 2010Monsef-Esfahani, Miri, et al., 2010Ogunwande, Flamini, et al., 2010Ogunwande, Flamini, et al., 2010Radulovic, Blagojevic, et al., 2010
Comment MSDC-RI MSDC-RI MSDC-RI MSDC-RI MSDC-RI
Column type CapillaryCapillaryCapillaryCapillaryCapillary
Active phase HP-5HP-5 MSHP-5 MSSLB-5 MSDB-5
Column length (m) 30.30.30.10.30.
Carrier gas HydrogenHeliumHeliumHeliumHelium
Substrate
Column diameter (mm) 0.250.250.250.100.25
Phase thickness (μm) 0.250.250.250.100.25
Tstart (C) 70.70.60.50.60.
Tend (C) 290.290.220.250.240.
Heat rate (K/min) 5.5.6.10.3.
Initial hold (min)   3.
Final hold (min)  10.
I 1532.1521.1516.1522.1525.
ReferenceRadulovic, Dordevic, et al., 2010Radulovic, Dordevic, et al., 2010, 2Safaei-Ghomi and Batooli, 2010Scandinaro, Tranchida, et al., 2010Scherer, Wagner, et al., 2010
Comment MSDC-RI MSDC-RI MSDC-RI MSDC-RI MSDC-RI
Column type CapillaryCapillaryCapillaryCapillaryCapillary
Active phase DB-5 MSDB-5DB-1-MSDB-5DB-1
Column length (m) 30.30.60.30.30.
Carrier gas HeliumHeliumHeliumHeliumHelium
Substrate
Column diameter (mm) 0.250.250.250.250.25
Phase thickness (μm) 0.250.250.250.250.25
Tstart (C) 60.40.30.80.50.
Tend (C) 240.240.200.240.220.
Heat rate (K/min) 3.3.2.3.4.
Initial hold (min)  1.4. 2.
Final hold (min)   35.2.2.
I 1516.1510.1507.1526.1510.
ReferenceSilva, Pott, et al., 2010de Souza, Lopes, et al., 2010Takeoka, Hobbs, et al., 2010Vahirua-Lechat, Mitermite, et al., 2010Xu, Tang, et al., 2010
Comment MSDC-RI MSDC-RI MSDC-RI MSDC-RI MSDC-RI
Column type CapillaryCapillaryCapillaryCapillaryCapillary
Active phase SE-54SPB-5DB-5HP-5 MSHP-5 MS
Column length (m) 30.30.30.30.30.
Carrier gas HeliumNitrogenHeliumHydrogenHelium
Substrate
Column diameter (mm) 0.250.530.250.250.25
Phase thickness (μm) 0.250.500.250.250.25
Tstart (C) 60.50.50.30.35.
Tend (C) 260.210.250.230.195.
Heat rate (K/min) 2.3.5.8.2.
Initial hold (min) 5.5.2.5.5.
Final hold (min) 999.45. 10.30.
I 1518.1531.1523.1539.1519.
ReferenceDayisoylu and Alma, 2009Gilani, Shah, et al., 2009Ho, Wang, et al., 2009Karlsson, Birgersson, et al., 2009Kim and Chung, 2009
Comment MSDC-RI MSDC-RI MSDC-RI MSDC-RI MSDC-RI
Column type CapillaryCapillaryCapillaryCapillaryCapillary
Active phase DB-5 MSVF-1 MSRTX-1RTX-1BP-1
Column length (m) 30.30.60.60.50.
Carrier gas HeliumHeliumHeliumHeliumHelium
Substrate
Column diameter (mm) 0.250.250.220.220.22
Phase thickness (μm) 0.250.250.250.250.25
Tstart (C) 50.60.60.60.60.
Tend (C) 250.280.230.230.220.
Heat rate (K/min) 2.4.2.2.2.
Initial hold (min) 5.5.
Final hold (min)  10.30.30.20.
I 1543.1524.1515.1520.1507.
ReferenceKoba, Sanda, et al., 2009Marchesini, Prada, et al., 2009Museli, Pau, et al., 2009Museli, Pau, et al., 2009Ottavioli, Bighelli, et al., 2009
Comment MSDC-RI MSDC-RI MSDC-RI MSDC-RI MSDC-RI
Column type CapillaryCapillaryCapillaryCapillaryCapillary
Active phase DB-55 % Phenyl methyl siloxaneDB-5DB-5 MSDB-5
Column length (m) 30.60.30.30.30.
Carrier gas HeliumHeliumNitrogenHeliumHelium
Substrate
Column diameter (mm) 0.250.250.250.250.25
Phase thickness (μm) 0.250.250.250.250.25
Tstart (C) 45.90.40.50.40.
Tend (C) 250.225.230.220.240.
Heat rate (K/min) 3.3.2.3.3.
Initial hold (min) 3.  2.1.
Final hold (min) 5.3. 70.
I 1518.1525.1523.1512.1510.
ReferencePorto, Decorti, et al., 2009Retta, Gattuso, et al., 2009Scrivanti, Anton, et al., 2009Shimizu, Imayoshi, et al., 2009de Souza, Lopes, et al., 2009
Comment MSDC-RI MSDC-RI MSDC-RI MSDC-RI MSDC-RI
Column type CapillaryCapillaryCapillaryCapillaryCapillary
Active phase DB-5 MSHP-5 MSHP-5 MSHP-5HP-5 MS
Column length (m) 30.30.30.30.30.
Carrier gas HeliumHeliumHeliumHelium
Substrate
Column diameter (mm) 0.250.250.250.250.25
Phase thickness (μm) 0.250.250.250.25
Tstart (C) 40.60.50.50.60.
Tend (C) 250.300.280.280.280.
Heat rate (K/min) 4.15.4.9.3.
Initial hold (min) 2.2. 3.
Final hold (min) 2.10. 3.
I 1524.1525.1527.1528.1524.
ReferenceSu, Wang, et al., 2009Xu, Han, et al., 2009Zhao, Zeng, et al., 2009Aicha, Ines, et al., 2008Baziou, Couladis, et al., 2008
Comment MSDC-RI MSDC-RI MSDC-RI MSDC-RI MSDC-RI
Column type CapillaryCapillaryCapillaryCapillaryCapillary
Active phase DB-5SE-52HP-5 MSHP-5VF-5MS
Column length (m) 25.50.30.30.30.
Carrier gas NitrogenHeliumHeliumHeliumHelium
Substrate
Column diameter (mm) 0.220.250.250.250.25
Phase thickness (μm) 0.250.250.250.250.25
Tstart (C) 50.60.50.50.240.
Tend (C) 300.280.230.300.320.
Heat rate (K/min) 6.53.4.3.20.
Initial hold (min) 2. 4. 1.
Final hold (min) 7.20.10.30.
I 1519.1528.1523.1518.1530.
ReferenceChieng, Assim, et al., 2008Djarri, Medjroubi, et al., 2008Forero, Quijano, et al., 2008Isidorov, Lech, et al., 2008Kowalski, 2008
Comment MSDC-RI MSDC-RI MSDC-RI MSDC-RI MSDC-RI
Column type CapillaryCapillaryCapillaryCapillaryCapillary
Active phase SLB-5 MSDB-5DB-5 MSRTX-1Elite-1
Column length (m) 30.60.30.60.30.
Carrier gas HeliumNitrogenHeliumHeHelium
Substrate
Column diameter (mm) 0.250.250.250.220.32
Phase thickness (μm) 0.250.250.250.250.25
Tstart (C) 50.60.50.60.60.
Tend (C) 250.250.300.230.246.
Heat rate (K/min) 3.5.5.2.3.
Initial hold (min) 2. 5.
Final hold (min) 10.10.5.35.
I 1521.1533.1517.1516.1520.
ReferenceLo Presti, Sciarrone, et al., 2008Mosayebi, Amin, et al., 2008Noudogbessi, Yedomonhan, et al., 2008Paolini, Tomi, et al., 2008Raj, Baby, et al., 2008
Comment MSDC-RI MSDC-RI MSDC-RI MSDC-RI MSDC-RI
Column type CapillaryCapillaryCapillaryCapillaryCapillary
Active phase SLB-5MSHP-5 MSBPX-5RTX-5HP-5
Column length (m) 10.30.7.520.30.
Carrier gas HeliumHeliumHeliumHeliumHelium
Substrate
Column diameter (mm) 0.180.250.100.180.25
Phase thickness (μm) 0.180.2510.0.200.32
Tstart (C) 40.50.60.50.60.
Tend (C) 295.240.240.280.250.
Heat rate (K/min) 10.3.3.4.5.
Initial hold (min) 1.5  1.30.
Final hold (min)
I 1517.1562.1524.1536.1522.
ReferenceRisticevic, Carasek, et al., 2008Sarikurkcu, Tepe, et al., 2008Shellie, 2008Skalicka-Wozniak, Los, et al., 2008Yassa and Akhani, 2008
Comment MSDC-RI MSDC-RI MSDC-RI MSDC-RI MSDC-RI
Column type CapillaryCapillaryCapillaryCapillaryCapillary
Active phase HP-5 MSDB-5DB-5MSHP-5MSCP Sil 5 CB
Column length (m) 30.50.30.30.30.
Carrier gas HeliumNitrogenHeHeN2
Substrate
Column diameter (mm) 0.250.200.250.250.32
Phase thickness (μm) 0.250.320.250.250.25
Tstart (C) 50.60.60.60.60.
Tend (C) 230.220.240.240.300.
Heat rate (K/min) 3.5.3.3.4.
Initial hold (min) 10.3.
Final hold (min) 10.5.
I 1524.1526.1525.1539.1508.
ReferenceAdams, Beauchamp, et al., 2007Amiri, 2007Andrade, Oliveira, et al., 2007Argyropoulou, Daferera, et al., 2007Baran, von Reuss, et al., 2007
Comment MSDC-RI MSDC-RI MSDC-RI MSDC-RI MSDC-RI
Column type CapillaryCapillaryCapillaryCapillaryCapillary
Active phase DB-5HP-5 MSHP-5DB-5MSRTX-5 MS
Column length (m) 30.30.30.30.30.
Carrier gas HeHeliumN2HeHe
Substrate
Column diameter (mm) 0.260.320.250.250.25
Phase thickness (μm) 0.250.250.250.250.25
Tstart (C) 60.60.50.60.60.
Tend (C) 240.280.240.240.200.
Heat rate (K/min) 3.4.5.3.2.
Initial hold (min)  5.1. 2.
Final hold (min)   4. 10.
I 1523.1520.1524.1522.1515.
ReferenceBos, Woerdenbag, et al., 2007Capetanos, Saroglou, et al., 2007Cheraif, Ben Jannet, et al., 2007Da Silva J.K.R., Sousa P.J.C., et al., 2007Edris, Chizzola, et al., 2007
Comment MSDC-RI MSDC-RI MSDC-RI MSDC-RI MSDC-RI
Column type CapillaryCapillaryCapillaryCapillaryCapillary
Active phase DB-5HP-5HP-5MSHP-5MSDB-1
Column length (m) 30.30.30.30.60.
Carrier gas HeliumHeliumHeHeNitrogen
Substrate
Column diameter (mm) 0.260.250.250.250.25
Phase thickness (μm) 0.250.260.250.250.25
Tstart (C) 60.60.60.60.60.
Tend (C) 290.240.250.250.250.
Heat rate (K/min) 3.4.2.2.4.
Initial hold (min)  2.8.8.1.
Final hold (min)  20.15.15.10.
I 1523.1526.1517.1527.1523.
ReferenceElfami, Bos, et al., 2007Farsam, Amanlou, et al., 2007Ferhat, Meklati, et al., 2007Ferhat, Tigrine-Kordjani, et al., 2007Ghasempour, Shirinpour, et al., 2007
Comment MSDC-RI MSDC-RI MSDC-RI MSDC-RI MSDC-RI
Column type CapillaryCapillaryCapillaryCapillaryCapillary
Active phase Col-Elite 5MSHP-1RTX-5 MSHP-101BP-1
Column length (m) 30.30.30.25.
Carrier gas HeHeHeHeHe
Substrate
Column diameter (mm) 0.250.250.250.2
Phase thickness (μm) 0.250.250.250.2
Tstart (C) 30.60.45.70.60.
Tend (C) 246.240.210.200.220.
Heat rate (K/min) 3.2.3.3.5.
Initial hold (min)    2.
Final hold (min)  20.  6.
I 1534.1497.1527.1480.1536.
ReferenceGudaityte and Venskutonis R.P., 2007Hachicha, Skanji, et al., 2007Hudaib and Aburjai, 2007Jerkovic, Mastelic, et al., 2007Kiran, Devi, et al., 2007
Comment MSDC-RI MSDC-RI MSDC-RI MSDC-RI MSDC-RI
Column type CapillaryCapillaryCapillaryCapillaryCapillary
Active phase DB-5SE-30HP-5DB-5MSAT-5
Column length (m) 30.30.30.30.60.
Carrier gas HeHeHeHeHelium
Substrate
Column diameter (mm) 0.250.250.250.250.25
Phase thickness (μm) 0.250.250.250.250.25
Tstart (C) 60.40.40.60.60.
Tend (C) 300.250.250.280.260.
Heat rate (K/min) 3.5.5.3.4.
Initial hold (min)  5.5.
Final hold (min)  10.10.30.
I 1512.1524.1522.1487.1526.
ReferenceLimberger, Scopel, et al., 2007Loizzo, Tundis, et al., 2007Loizzo, Tundis, et al., 2007Marongiu B., Piras A., et al., 2007Meccia, Rojas, et al., 2007
Comment MSDC-RI MSDC-RI MSDC-RI MSDC-RI MSDC-RI
Column type CapillaryCapillaryCapillaryCapillaryCapillary
Active phase DB-5ZB-5DB-1DB-5DB-5
Column length (m) 30.30.30.30.30.
Carrier gas He HeliumHeliumHelium
Substrate
Column diameter (mm) 0.250.250.250.250.25
Phase thickness (μm) 0.250.250.250.250.25
Tstart (C) 60.60.50.60.60.
Tend (C) 240.220.260.300.220.
Heat rate (K/min) 2.4.2.53.4.
Initial hold (min)  5.1.
Final hold (min)  20.20.
I 1515.1521.1501.1494.1525.
ReferenceMiyazawa and Tamura, 2007Mohottalage, Tabacchi, et al., 2007Monser-Esfahani, Karamkhani, et al., 2007Moreno, Lima, et al., 2007Morteza-Semnani, Saeedi, et al., 2007
Comment MSDC-RI MSDC-RI MSDC-RI MSDC-RI MSDC-RI
Column type CapillaryCapillaryCapillaryCapillaryCapillary
Active phase DB-5HP-5HP-5 MSSPB-1DB-5
Column length (m) 30.25.25.30.30.
Carrier gas HeH2HeliumHeHydrogen
Substrate
Column diameter (mm) 0.250.20.250.20.25
Phase thickness (μm) 0.320.330.250.20.25
Tstart (C) 50.60.100.70.50.
Tend (C) 250.240.280.220.250.
Heat rate (K/min) 5.3.4.3.4.
Initial hold (min)   3.
Final hold (min)   5.15.
I 1520.1524.1527.1508.1524.
ReferenceNori-Shargh, Raftari, et al., 2007Oliveira, Leitão, et al., 2007Phutdhawong, Kawaree, et al., 2007Pinto, Salgueiro, et al., 2007Pontes, de Olivera, et al., 2007
Comment MSDC-RI MSDC-RI MSDC-RI MSDC-RI MSDC-RI
Column type CapillaryCapillaryCapillaryCapillaryCapillary
Active phase SPB-5BPX-5BPX-5BPX-5DB-1
Column length (m) 30.50.50.50.60.
Carrier gas HeHeHeHeNitrogen
Substrate
Column diameter (mm) 0.250.220.220.220.25
Phase thickness (μm) 0.25 1.1.0.25
Tstart (C) 50.50.50.50.60.
Tend (C) 250.300.300.300.250.
Heat rate (K/min) 2.4.4.4.4.
Initial hold (min)  1.1.1.1.
Final hold (min)  10.10.10.10.
I 1521.1556.1545.1556.1523.
ReferenceRaal, Orav, et al., 2007Rali, Wossa, et al., 2007Rali, Wossa, et al., 2007, 2Rali, Wossa, et al., 2007, 2Reza, Ebrahim, et al., 2007
Comment MSDC-RI MSDC-RI MSDC-RI MSDC-RI MSDC-RI
Column type CapillaryCapillaryCapillaryCapillaryCapillary
Active phase HP-5 MSHP-5 MSDB-5DB-5DB-5
Column length (m) 60.30.30.30.30.
Carrier gas HydrogenHeliumHeHe
Substrate
Column diameter (mm) 0.250.250.250.250.25
Phase thickness (μm) 0.250.250.250.250.25
Tstart (C) 60.60.50.60.40.
Tend (C) 260.220.240.320.210.
Heat rate (K/min) 4.5.4.10.2.
Initial hold (min)  3.
Final hold (min) 20.3. 4.33.
I 1527.1510.1526.1514.1526.
ReferenceRojas, Velasco, et al., 2007Safaei-Ghomi, Bamoniri, et al., 2007Sefidkon, Abbasi, et al., 2007Smelcerovic, Spiteller, et al., 2007Sylvestre, Longtin, et al., 2007
Comment MSDC-RI MSDC-RI MSDC-RI MSDC-RI MSDC-RI
Column type CapillaryCapillaryCapillaryCapillaryCapillary
Active phase Elite-5MSHP-5MSHP-5 MSHP-5MSHP-5
Column length (m) 30.30.30.30.30.
Carrier gas HeHeHeliumHe
Substrate
Column diameter (mm) 0.320.250.250.250.25
Phase thickness (μm) 0.50.250.250.250.25
Tstart (C) 40.60.60.40.40.
Tend (C) 280.280.280.250.240.
Heat rate (K/min) 4.3.3.3.5.
Initial hold (min) 5.  5.3.
Final hold (min) 10.  10.10.
I 1527.1480.1523.1504.1521.
ReferenceTava, Pecetti, et al., 2007Tzakou, Bazos, et al., 2007Vagionas, Graikou, et al., 2007Vichi, Riu-Aumatell, et al., 2007Wenguang, Wenlai, et al., 2007
Comment MSDC-RI MSDC-RI MSDC-RI MSDC-RI MSDC-RI
Column type CapillaryCapillaryCapillaryCapillaryCapillary
Active phase HP-5HP-5MSDB-5DB-5CP Sil 5 CB
Column length (m) 30.30.30.30.25.
Carrier gas HeHeHe He
Substrate
Column diameter (mm) 0.250.250.250.25
Phase thickness (μm) 0.320.250.250.25
Tstart (C) 60.40.60.60.80.
Tend (C) 250.260.300.300.270.
Heat rate (K/min) 5.4.3.3.10.
Initial hold (min) 30.
Final hold (min)
I 1522.1519.31514.1519.1520.
ReferenceYassa and Akhani, 2007Zizovic, Stamenic, et al., 2007Apel, Sobral, et al., 2006Apel, Sobral, et al., 2006, 2Ayoub, Al-Azizi, et al., 2006
Comment MSDC-RI MSDC-RI MSDC-RI MSDC-RI MSDC-RI
Column type CapillaryCapillaryCapillaryCapillaryCapillary
Active phase HP-5ZB-5AT-5BP-1BP-1
Column length (m) 60.30.60.50.50.
Carrier gas He HeHe
Substrate
Column diameter (mm) 0.250.250.250.220.22
Phase thickness (μm) 0.250.250.250.250.25
Tstart (C) 60.40.60.60.60.
Tend (C) 250.300.200.220.220.
Heat rate (K/min) 3.2.4.2.2.
Initial hold (min)
Final hold (min)   20.20.20.
I 1532.1503.1526.1511.1517.
ReferenceBertrand, Comte, et al., 2006Biondi, Sari, et al., 2006Borges, Rojas, et al., 2006Boti, Muselli, et al., 2006Boti, Yao, et al., 2006
Comment MSDC-RI MSDC-RI MSDC-RI MSDC-RI MSDC-RI
Column type CapillaryCapillaryCapillaryCapillaryCapillary
Active phase HP-5MSHP-1HP-1HP-1HP-1
Column length (m) 30.50.50.50.50.
Carrier gas HeHeHeHeHe
Substrate
Column diameter (mm) 0.250.20.20.20.2
Phase thickness (μm) 0.250.330.330.50.33
Tstart (C) 60.60.60.60.60.
Tend (C) 280.250.250.250.250.
Heat rate (K/min) 3.2.2.2.2.
Initial hold (min)  4.4. 4.
Final hold (min)  30.30.120.30.
I 1524.1511.1519.1520.1520.
ReferenceBozin, Mimicá-Dukic, et al., 2006Castel, Fernandez, et al., 2006Castel, Fernandez, et al., 2006Castel, Fernandez, et al., 2006, 2Castel, Fernandez, et al., 2006, 2
Comment MSDC-RI MSDC-RI MSDC-RI MSDC-RI MSDC-RI
Column type CapillaryCapillaryCapillaryCapillaryCapillary
Active phase SPB-1DB-1DB-5HP-5MSDB-5
Column length (m) 30.60.30.30.30.
Carrier gas HeliumNitrogen  Helium
Substrate
Column diameter (mm) 0.200.250.320.250.26
Phase thickness (μm) 0.20 0.250.250.25
Tstart (C) 70.40.60.60.60.
Tend (C) 220.200.230.280.290.
Heat rate (K/min) 3.2.3.4.3.
Initial hold (min)  1.
Final hold (min) 15.9.15.
I 1508.1508.1524.1521.1523.
ReferenceCavaleiro, Pinto, et al., 2006Chen, Sheu, et al., 2006Damjanovic, Skala, et al., 2006Ebrahim Sajjadi and Mehregan, 2006Elfami, Komar, et al., 2006
Comment MSDC-RI MSDC-RI MSDC-RI MSDC-RI MSDC-RI
Column type CapillaryCapillaryCapillaryCapillaryCapillary
Active phase HP-1HP-5HP-1DB-5DB-1
Column length (m) 50.30.50.30.60.
Carrier gas HeHeHe He
Substrate
Column diameter (mm) 0.20.250.20.250.25
Phase thickness (μm) 0.330.250.330.250.25
Tstart (C) 60.50.60.40.60.
Tend (C) 250.300.250.210.240.
Heat rate (K/min) 2.5.2.2.5.
Initial hold (min)  5. 2.2.
Final hold (min) 60.5.40.33.
I 1521.1517.1508.1526.1504.
ReferenceFernandez, Pintaric, et al., 2006Figuérédo, Cabassu, et al., 2006Filippi, Lanfranchi, et al., 2006Garneau F.X., Collin G., et al., 2006Gohari, Hadjiakhoondi, et al., 2006
Comment MSDC-RI MSDC-RI MSDC-RI MSDC-RI MSDC-RI
Column type CapillaryCapillaryCapillaryCapillaryCapillary
Active phase DB-5DB-1DB-5HP-5DB-5
Column length (m) 30.60.30.30.30.
Carrier gas HeHeHeHeHelium
Substrate
Column diameter (mm) 0.250.250.250.250.25
Phase thickness (μm) 0.250.250.250.250.25
Tstart (C) 60.60.60.60.60.
Tend (C) 240.240.240.240.260.
Heat rate (K/min) 5.5.5.4.3.
Initial hold (min) 2.2.2.
Final hold (min)
I 1523.1504.1523.1524.1521.
ReferenceGohari, Hadjiakhoondi, et al., 2006Gohari A.R., Hadjiakhoondi A., et al., 2006Gohari A.R., Hadjiakhoondi A., et al., 2006Ibañez and Usubillaga, 2006Javidnia, Miri, et al., 2006
Comment MSDC-RI MSDC-RI MSDC-RI MSDC-RI MSDC-RI
Column type CapillaryCapillaryCapillaryCapillaryCapillary
Active phase BP-1HP-5DB-1BP-1CP Sil 5 CB
Column length (m)  30.60.50.30.
Carrier gas HeliumHelium HeN2
Substrate
Column diameter (mm)  0.320.250.220.32
Phase thickness (μm)  0.250.250.250.25
Tstart (C) 60.60.70.60.50.
Tend (C) 220.260.230.220.300.
Heat rate (K/min) 5.5.2.2.4.
Initial hold (min)  2.2.
Final hold (min) 6.13.20.20.
I 1536.1526.1512.1520.1510.
ReferenceKiran, Bhavani, et al., 2006Kucuk, Gulec, et al., 2006Lan Phi N.T., Nishiyama C., et al., 2006Lesueur, Ban, et al., 2006Lis and Milczarek, 2006
Comment MSDC-RI MSDC-RI MSDC-RI MSDC-RI MSDC-RI
Column type CapillaryCapillaryCapillaryCapillaryCapillary
Active phase CP Sil 5 CBHP-5 MSHP-5DB-5BP-1
Column length (m) 30.30.30.30.25.
Carrier gas N2NitrogenN2HeliumHe
Substrate
Column diameter (mm) 0.250.250.250.250.3
Phase thickness (μm) 0.250.250.520.25
Tstart (C) 50.50.50.50.70.
Tend (C) 200.280.280.250.220.
Heat rate (K/min) 5.5.5.3.4.
Initial hold (min)    5.2.
Final hold (min)  5.5. 10.
I 1520.1508.1508.1526.1523.
ReferenceMartin, Joseph, et al., 2006Marzouk, Mansour, et al., 2006Marzouk, Neffati, et al., 2006Mirza, Navaei, et al., 2006Moody, Gundidza, et al., 2006
Comment MSDC-RI MSDC-RI MSDC-RI MSDC-RI MSDC-RI
Column type CapillaryCapillaryCapillaryCapillaryCapillary
Active phase DB-5DB-5DB-5CP-Sil 5 CBNB-30
Column length (m) 30.30.30.25.30.
Carrier gas HeHeHeHydrogenHe
Substrate
Column diameter (mm) 0.250.250.250.250.2
Phase thickness (μm) 0.250.250.250.150.25
Tstart (C) 60.60.60.50.50.
Tend (C) 220.220.220.230.250.
Heat rate (K/min) 4.4.4.3.2.
Initial hold (min)  5.5.
Final hold (min)
I 1525.1527.1525.1522.1518.
ReferenceMorteza-Semnani, Akbarzadeh, et al., 2006Morteza-Semnani K., Akbarzadeh M., et al., 2006Morteza-Semnani K., Saeedi M., et al., 2006Olawore, Usman, et al., 2006Orav, Raal, et al., 2006
Comment MSDC-RI MSDC-RI MSDC-RI MSDC-RI MSDC-RI
Column type CapillaryCapillaryCapillaryCapillaryCapillary
Active phase DB-5DB-1HP-5MSHP-5DB-5
Column length (m) 25.50.30.30.30.
Carrier gas N2N2HeHeHydrogen
Substrate
Column diameter (mm) 0.250.250.250.250.25
Phase thickness (μm) 0.150.250.250.250.25
Tstart (C) 50.95.40.60.70.
Tend (C) 200.240.260.220.280.
Heat rate (K/min) 4.4.4.5.4.
Initial hold (min) 3.  10.4.
Final hold (min)
I 1520.1516.1529.1522.1522.
ReferenceOuamba, Ouabonzi, et al., 2006Pala-Paul J., Perez-Alonso M.J., et al., 2006Petrovic, Ristic, et al., 2006Pintore G., Chessa M., et al., 2006Pino, Marbot, et al., 2006
Comment MSDC-RI MSDC-RI MSDC-RI MSDC-RI MSDC-RI
Column type CapillaryCapillaryCapillaryCapillaryCapillary
Active phase DB-5DB-5HP-5HP-5DB-5
Column length (m) 30.30.30.25.30.
Carrier gas HydrogenHydrogenH2H2Hydrogen
Substrate
Column diameter (mm) 0.250.250.250.320.25
Phase thickness (μm) 0.250.250.250.250.25
Tstart (C) 70.70.50.60.120.
Tend (C) 280.280.280.240.180.
Heat rate (K/min) 4.4.4.3.2.
Initial hold (min) 4.4.2.
Final hold (min)   10.
I 1524.1529.1524.1527.1508.
ReferencePino, Marbot, et al., 2006Pino, Marbot, et al., 2006Pino, Sauri-Duch, et al., 2006Potzernheim, Bizzo, et al., 2006Pripdeevech, Wongpornchai, et al., 2006
Comment MSDC-RI MSDC-RI MSDC-RI MSDC-RI MSDC-RI
Column type CapillaryCapillaryCapillaryCapillaryCapillary
Active phase HP-5MSDB-5DB-5DB-5ZB-5
Column length (m) 30.30.30.30.30.
Carrier gas  HeHeHeHe
Substrate
Column diameter (mm) 0.250.250.250.250.25
Phase thickness (μm) 0.250.250.250.250.25
Tstart (C) 50.60.60.60.40.
Tend (C) 250.200.200.260.300.
Heat rate (K/min) 10.2.2.5.2.
Initial hold (min) 5.
Final hold (min)  60.60.
I 1532.1525.1523.1534.1503.
ReferenceRobinson, 2006Rout, Naik, et al., 2006Rout, Naik, et al., 2006Sabulal, Dan, et al., 2006Sari M., Biondi D.M., et al., 2006
Comment MSDC-RI MSDC-RI MSDC-RI MSDC-RI MSDC-RI
Column type CapillaryCapillaryCapillaryCapillaryCapillary
Active phase HP-5DB-1CP Sil 5 CBCP Sil 5 CBSPB-5
Column length (m) 25.60.25.25.60.
Carrier gas N2HeliumH2 He
Substrate
Column diameter (mm) 0.20.250.250.250.32
Phase thickness (μm) 0.330.25  1.
Tstart (C) 30.60.50.50.40.
Tend (C) 280.250.230.230.230.
Heat rate (K/min) 3.5.3.3.3.
Initial hold (min)     5.
Final hold (min)  10.  2.
I 1536.1515.1517.1518.1551.
ReferenceShafi, Jose, et al., 2006Sonboli, Mirjalili, et al., 2006Tesso, König, et al., 2006Tesso, Kubeczka, et al., 2006Tornambe, Cornu, et al., 2006
Comment MSDC-RI MSDC-RI MSDC-RI MSDC-RI MSDC-RI
Column type CapillaryCapillaryCapillaryCapillaryCapillary
Active phase DB-5DB-1HP-5HP-5SPB-1
Column length (m) 30.50.25.30.50.
Carrier gas N2N2H2HeHe
Substrate
Column diameter (mm) 0.250.250.320.250.2
Phase thickness (μm) 0.250.250.520.250.33
Tstart (C) 60.90.50.60.50.
Tend (C) 240.240.280.250.220.
Heat rate (K/min) 4.4.2.510.4.
Initial hold (min)   5.2.1.
Final hold (min)    10.10.
I 1505.1509.1530.1540.1510.
ReferenceTrilles, Bombarda, et al., 2006Velasco-Negueruela, Pérez-Alonso, et al., 2006Wang, Kong, et al., 2006Wang, Yang, et al., 2006Wong, Lim, et al., 2006
Comment MSDC-RI MSDC-RI MSDC-RI MSDC-RI MSDC-RI
Column type CapillaryCapillaryCapillaryCapillaryCapillary
Active phase HP-5MSDB-5HP-1DB-5MSDB-5
Column length (m) 30.30.50.30.50.
Carrier gas HeHeHeHe
Substrate
Column diameter (mm) 0.250.250.20.250.3
Phase thickness (μm) 0.250.250.50.250.25
Tstart (C) 60.60.60.60.60.
Tend (C) 275.210.250.240.240.
Heat rate (K/min) 4.3.2.3.2.
Initial hold (min)  5.
Final hold (min)   60.
I 1526.1522.1514.1525.1521.
ReferenceAsadipour, Mehrabani, et al., 2005Askari and Sefidkon, 2005Bendimerad and Bendiab, 2005Busman, Zoghbi, et al., 2005Chagonda and Chalchat, 2005
Comment MSDC-RI MSDC-RI MSDC-RI MSDC-RI MSDC-RI
Column type CapillaryCapillaryCapillaryCapillaryCapillary
Active phase DB-5DB-5DB-5Methyl SiliconeSPB-5
Column length (m) 25.30.30.60.60.
Carrier gas  HeHeHeHe
Substrate
Column diameter (mm) 0.250.250.250.30.32
Phase thickness (μm) 0.150.250.25 1.
Tstart (C) 40.60.60.50.40.
Tend (C) 220.240.240.240.230.
Heat rate (K/min) 3.3.3.3.3.
Initial hold (min) 5.   5.
Final hold (min)
I 1515.1527.1525.1516.1551.
ReferenceChagonda and Chalchat, 2005, 2Chaverri and Cicció, 2005Chaverri and Cicció, 2005Chalchat and Özcan, 2005Cornu, Kondjoyan, et al., 2005
Comment MSDC-RI MSDC-RI MSDC-RI MSDC-RI MSDC-RI
Column type CapillaryCapillaryCapillaryCapillaryCapillary
Active phase BPX-5ZB-5HP-5CP Sil 8 CBDB-1
Column length (m) 25.60.25.30.60.
Carrier gas HeHeHeHeN2
Substrate
Column diameter (mm) 0.220.250.20.250.25
Phase thickness (μm) 0.250.250.330.250.25
Tstart (C) 50.40.60.80.60.
Tend (C) 320.250.240.200.250.
Heat rate (K/min) 5.6.3.3.5.
Initial hold (min) 5.7. 5.
Final hold (min)  1.7.5.10.
I 1522.1543.1520.1530.1525.
ReferenceDickschat, Martens, et al., 2005Dötterl, Wolfe, et al., 2005Duarte, Figueira, et al., 2005Facey, Porter, et al., 2005Fakhari A.R., Sonboli A., et al., 2005
Comment MSDC-RI MSDC-RI MSDC-RI MSDC-RI MSDC-RI
Column type CapillaryCapillaryCapillaryCapillaryCapillary
Active phase DB-5HP-1HP-5HP-5MSHP-5MS
Column length (m) 30.50.30.30.25.
Carrier gas He HeHeHe
Substrate
Column diameter (mm) 0.250.20.250.250.25
Phase thickness (μm) 0.250.250.250.25
Tstart (C) 60.60.50.60.50.
Tend (C) 300.250.300.200.250.
Heat rate (K/min) 3.2.5.4.3.
Initial hold (min) 3.60.5.30.3.
Final hold (min)   5. 10.
I 1508.1513.1517.1514.1525.
ReferenceFerraz, Limberger, et al., 2005Fernandez, Lizzani-Cuvelier, et al., 2005Figuérédo, Cabassu, et al., 2005Gauvin and Smadja, 2005Ghasemi Y., Faridi P., et al., 2005
Comment MSDC-RI MSDC-RI MSDC-RI MSDC-RI MSDC-RI
Column type CapillaryCapillaryCapillaryCapillaryCapillary
Active phase RSL-200HP-5DB-1DB-1DB-5
Column length (m) 30.25.30.60.30.
Carrier gas  H2HeHe
Substrate
Column diameter (mm) 0.250.320.250.250.25
Phase thickness (μm) 0.250.520.250.250.25
Tstart (C) 40.40.50.50.35.
Tend (C) 280.240.265.250.280.
Heat rate (K/min) 6.4.2.54.4.
Initial hold (min) 2. 1.5.2.
Final hold (min) 10. 20.
I 1522.1520.1512.1522.1530.
ReferenceJirovetz, Buchbauer, et al., 2005Jovanovic, Kitic, et al., 2005Khanavi, Ghasemian, et al., 2005Khajeh, Yamini, et al., 2005Kowalski and Wolski, 2005
Comment MSDC-RI MSDC-RI MSDC-RI MSDC-RI MSDC-RI
Column type CapillaryCapillaryCapillaryCapillaryCapillary
Active phase DB-5HP-5DB-5DB-5MSDB-5MS
Column length (m) 30.60.30.30.30.
Carrier gas HeliumHeHeHeHe
Substrate
Column diameter (mm) 0.250.320.250.250.25
Phase thickness (μm) 0.250.250.250.250.25
Tstart (C) 35.30.60.60.60.
Tend (C) 280.260.230.280.280.
Heat rate (K/min) 4.2.3.3.3.
Initial hold (min) 2.2. 30.30.
Final hold (min)  28.
I 1530.1529.21517.1490.1492.
ReferenceKowalski, 2005Leffingwell and Alford, 2005Limberger, Sobral, et al., 2005Marongiu, Piras, et al., 2005Marongiu, Piras, et al., 2005
Comment MSDC-RI MSDC-RI MSDC-RI MSDC-RI MSDC-RI
Column type CapillaryCapillaryCapillaryCapillaryCapillary
Active phase DB-5DB-5CP Sil 5 CBCP Sil 5 CBHP-5
Column length (m) 30.30.25.25.30.
Carrier gas HeHe  He
Substrate
Column diameter (mm) 0.250.250.250.250.25
Phase thickness (μm) 0.250.250.150.150.25
Tstart (C) 60.60.50.50.70.
Tend (C) 220.220.230.230.240.
Heat rate (K/min) 4.4.3.3.5.
Initial hold (min) 5.4.
Final hold (min)
I 1523.1525.1522.1522.1524.
ReferenceMorteza-Semnani, Akbarzadeh, et al., 2005Morteza-Semnani and Saeedi, 2005Ogunwande, Olawore, et al., 2005Olawore, Ogunwande, et al., 2005Oyedeji, Yani, et al., 2005
Comment MSDC-RI MSDC-RI MSDC-RI MSDC-RI MSDC-RI
Column type CapillaryCapillaryCapillaryCapillaryCapillary
Active phase DB-1RTX-5 MSHP-5MSSPB-5CP Sil 5 CB
Column length (m) 50.30.30.30.30.
Carrier gas N2He HeHe
Substrate
Column diameter (mm) 0.250.250.20.250.25
Phase thickness (μm) 0.250.25 0.250.25
Tstart (C) 95.50.60.60.40.
Tend (C) 240.280.280.250.220.
Heat rate (K/min) 4.8.3.4.4.
Initial hold (min)  2. 2.1.
Final hold (min)  2. 20.
I 1522.1535.1523.1524.1523.
ReferencePala-Paul, Perez-Alonso, et al., 2005Pellati, Benvenuti, et al., 2005Petrakis, Roussis, et al., 2005Pino, Marbot, et al., 2005Rohloff and Bones, 2005
Comment MSDC-RI MSDC-RI MSDC-RI MSDC-RI MSDC-RI
Column type CapillaryCapillaryCapillaryCapillaryCapillary
Active phase CP Sil 5 CBDB-5HP-5HP-5MSHP-5MS
Column length (m) 30.25.30.30.30.
Carrier gas HeHeHeHeHe
Substrate
Column diameter (mm) 0.250.250.250.250.25
Phase thickness (μm) 0.250.25 0.250.25
Tstart (C) 40.60.60.60.60.
Tend (C) 220.200.240.280.275.
Heat rate (K/min) 4.2.5.4.4.
Initial hold (min) 1.
Final hold (min)  80.
I 1523.1521.1523.1522.1521.
ReferenceRohloff and Bones, 2005Rout, Misra, et al., 2005Saeidnia, Gohari, et al., 2005Sajjadi S.E. and Eskandari B., 2005Sajjadi and Ghannadi, 2005
Comment MSDC-RI MSDC-RI MSDC-RI MSDC-RI MSDC-RI
Column type CapillaryCapillaryCapillaryCapillaryCapillary
Active phase DB-5DB-1DB-5DB-5HP-5MS
Column length (m) 30.30.30.30.30.
Carrier gas HeHeHeHeHe
Substrate
Column diameter (mm) 0.250.250.250.250.25
Phase thickness (μm) 0.250.25 0.250.25
Tstart (C) 60.50.40.40.60.
Tend (C) 220.265.240.260.280.
Heat rate (K/min) 3.2.54.2.3.
Initial hold (min) 4.1. 5.5.
Final hold (min)  20. 20.
I 1527.1498.1522.1518.1523.
ReferenceSalehi, Sefidkon, et al., 2005Sarkhail, Amin, et al., 2005Sefidkon and Jamzad, 2005Senatore, Apostolides Arnold, et al., 2005Setzer, Noletto, et al., 2005
Comment MSDC-RI MSDC-RI MSDC-RI MSDC-RI MSDC-RI
Column type CapillaryCapillaryCapillaryCapillaryCapillary
Active phase DB-5DB-5DB-5PE-5HP-5MS
Column length (m) 30.30.30.30.30.
Carrier gas HeHeHeH2He
Substrate
Column diameter (mm) 0.250.250.250.320.25
Phase thickness (μm) 0.250.250.250.250.25
Tstart (C) 60.60.60.60.60.
Tend (C) 300.300.300.230.280.
Heat rate (K/min) 3.3.3.5.3.
Initial hold (min)    2.
Final hold (min)    4.
I 1515.1515.1515.1517.1523.
ReferenceSimoes-Pires C.A., Debenedetti S., et al., 2005Simoes-Pires C.A., Debenedetti S., et al., 2005Simoes-Pires C.A., Debenedetti S., et al., 2005Singh, Raina, et al., 2005Slavkovska, Couladis, et al., 2005
Comment MSDC-RI MSDC-RI MSDC-RI MSDC-RI MSDC-RI
Column type CapillaryCapillaryCapillaryCapillaryCapillary
Active phase RTX-1RTX-1DB-1BP-1DB-5
Column length (m) 60.60.60.30.30.
Carrier gas HeHeHeN2
Substrate
Column diameter (mm) 0.250.250.250.320.25
Phase thickness (μm) 0.250.250.250.250.25
Tstart (C) 60.60.60.60.40.
Tend (C) 250.25.250.220.210.
Heat rate (K/min) 5.5.5.5.2.
Initial hold (min)     2.
Final hold (min) 10.10.10.15.33.
I 1523.1520.1517.1523.1530.
ReferenceSonboli A., Fakhari A.R., et al., 2005Sonboli, Salehi, et al., 2005Sonboli, Salehi, et al., 2005, 2Srivastava, Srivastava, et al., 2005Stevanovic, Garneau, et al., 2005
Comment MSDC-RI MSDC-RI MSDC-RI MSDC-RI MSDC-RI
Column type CapillaryCapillaryCapillaryCapillaryCapillary
Active phase CP Sil 8 CBRTX-5HP-5 MSHP-5MSDB-5
Column length (m) 30.30.30.30.30.
Carrier gas He HeHeHe
Substrate
Column diameter (mm) 0.250.250.250.250.32
Phase thickness (μm)  0.250.500.250.25
Tstart (C) 60.60.60.60.60.
Tend (C) 290.220.260.280.280.
Heat rate (K/min) 3.3.3.3.3.
Initial hold (min) 5.
Final hold (min)   20.
I 1519.1523.1518.1484.1495.
ReferenceSuárez, Vásquez, et al., 2005Szafranek, Chrapkowska, et al., 2005Topçu, Barla, et al., 2005Tzakou, Bazos, et al., 2005Tzakou and Constantinidis, 2005
Comment MSDC-RI MSDC-RI MSDC-RI MSDC-RI MSDC-RI
Column type CapillaryCapillaryCapillaryCapillaryCapillary
Active phase HP-5 MSHP-5DB-1HP-5MSDB-5
Column length (m) 30.30.50.30.30.
Carrier gas HeliumHelium  H2
Substrate
Column diameter (mm) 0.250.320.250.250.25
Phase thickness (μm) 0.250.250.250.250.25
Tstart (C) 60.40.60.40.50.
Tend (C) 240.300.240.220.290.
Heat rate (K/min) 3.4.3.3.4.
Initial hold (min)    5.
Final hold (min)  5. 10.
I 1523.1512.1497.1504.1515.
ReferenceUrdampilleta, Amat, et al., 2005Utsunomia, Kawata, et al., 2005Velasco-Negueruela, Pérez-Alonso, et al., 2005Vichi, Riu-Aumatell, et al., 2005Abreu, Reis, et al., 2004
Comment MSDC-RI MSDC-RI MSDC-RI MSDC-RI MSDC-RI
Column type CapillaryCapillaryCapillaryCapillaryCapillary
Active phase CP Sil 5 CBBP-1DB-5DB-1SPB-5
Column length (m) 30.50.30.30.60.
Carrier gas N2 HeN2He
Substrate
Column diameter (mm) 0.250.220.250.250.32
Phase thickness (μm) 0.250.250.250.251.
Tstart (C) 50.60.60.50.60.
Tend (C) 200.220.240.200.200.
Heat rate (K/min) 5.2.2.5.4.
Initial hold (min)
Final hold (min)  20.  30.
I 1515.1514.1523.1519.1537.
ReferenceAgnaniet, Menut, et al., 2004Blanc, Muselli, et al., 2004Cicció, 2004Fekam Boyom, Fotio, et al., 2004Gauvin, Ravaomanarivo, et al., 2004
Comment MSDC-RI MSDC-RI MSDC-RI MSDC-RI MSDC-RI
Column type CapillaryCapillaryCapillaryCapillaryCapillary
Active phase DB-5DB-1DB-5RTX-1SE-54
Column length (m) 30.25.25.30.30.
Carrier gas N2 NitrogenN2He
Substrate
Column diameter (mm) 0.250.250.250.250.25
Phase thickness (μm) 0.250.250.250.250.25
Tstart (C) 40.60.60.60.60.
Tend (C) 230.180.240.300.260.
Heat rate (K/min) 2.3.3.4.2.
Initial hold (min)  10.  5.
Final hold (min)  10.
I 1524.1522.1526.1516.1511.
ReferenceGonzález, Guerra, et al., 2004bin Jantan, Ayop, et al., 2004JAvidnia, Mojab, et al., 2004Kalemba and Thiem, 2004Kilic, Hafizoglu, et al., 2004
Comment MSDC-RI MSDC-RI MSDC-RI MSDC-RI MSDC-RI
Column type CapillaryCapillaryCapillaryCapillaryCapillary
Active phase DB-5DB-5MSDB-5RTX-1DB-5
Column length (m) 30.30.30.30.30.
Carrier gas HeHeHeN2
Substrate
Column diameter (mm) 0.250.250.250.320.25
Phase thickness (μm) 0.250.250.250.250.25
Tstart (C) 60.60.60.60.40.
Tend (C) 300.240.300.300.210.
Heat rate (K/min) 3.3.3.4.2.
Initial hold (min)     2.
Final hold (min)     33.
I 1497.1525.1517.1515.1527.
ReferenceLago, de Ávila, et al., 2004paz Lima, Silva, et al., 2004Limberger, Sobral, et al., 2004Lis, Boczek, et al., 2004Lopez Arze, Collin, et al., 2004
Comment MSDC-RI MSDC-RI MSDC-RI MSDC-RI MSDC-RI
Column type CapillaryCapillaryCapillaryCapillaryCapillary
Active phase HP-5MSHP-5MSHP-5MSDB-5MSHP-5MS
Column length (m) 30.30.30.30.30.
Carrier gas HeHeHeHeHe
Substrate
Column diameter (mm) 0.250.250.250.250.25
Phase thickness (μm) 0.250.250.250.250.25
Tstart (C) 60.60.60.60.60.
Tend (C) 280.280.280.280.275.
Heat rate (K/min) 3.3.3.3.4.
Initial hold (min)
Final hold (min)    30.
I 1521.1519.1509.1481.1527.
ReferenceMalencic, Couladis, et al., 2004Malencic, Couladis, et al., 2004Malencic, Couladis, et al., 2004Marongiu, Porcedda, et al., 2004Mehrabani, Asadipour, et al., 2004
Comment MSDC-RI MSDC-RI MSDC-RI MSDC-RI MSDC-RI
Column type CapillaryCapillaryCapillaryCapillaryCapillary
Active phase HP-5MSDB-5DB-5DB-1NB-30
Column length (m) 30.30.50.60.50.
Carrier gas HeHeliumHeliumHeHe
Substrate
Column diameter (mm) 0.250.250.250.250.2
Phase thickness (μm) 0.25  0.250.25
Tstart (C) 60.60.60.50.50.
Tend (C) 280.240.240.270.250.
Heat rate (K/min) 3.2.2.4.2.
Initial hold (min)
Final hold (min)  999.999.
I 1524.1512.1512.1512.1519.
ReferenceMimica-Dukic, Bozin, et al., 2004Miyazawa, Fuhita, et al., 2004Miyazawa, Fujita, et al., 2004Nik, Mirza, et al., 2004Orav, Stulova, et al., 2004
Comment MSDC-RI MSDC-RI MSDC-RI MSDC-RI MSDC-RI
Column type CapillaryCapillaryCapillaryCapillaryCapillary
Active phase NB-30DB-5DB-1NB-30DB-5
Column length (m) 50.30.50.50.30.
Carrier gas HeHeN2HeHe
Substrate
Column diameter (mm) 0.20.250.250.200.25
Phase thickness (μm) 0.250.250.250.250.25
Tstart (C) 50.35.95.50.35.
Tend (C) 250.220.240.250.220.
Heat rate (K/min) 2.3.4.2.2.5
Initial hold (min)
Final hold (min)     6.
I 1517.1524.1503.1518.1523.
ReferenceOrav, Stulova, et al., 2004Palá-Paúl, Brophy, et al., 2004Palá-Paúl, Velasco-Negueruela, et al., 2004Raal, Paaver, et al., 2004Rohloff, Mordal, et al., 2004
Comment MSDC-RI MSDC-RI MSDC-RI MSDC-RI MSDC-RI
Column type CapillaryCapillaryCapillaryCapillaryCapillary
Active phase DB-1HP-1DB-5HP-5DB-5
Column length (m) 30.30.30.25.30.
Carrier gas HeHeHeH2
Substrate
Column diameter (mm) 0.250.250.250.320.25
Phase thickness (μm) 0.250.330.250.520.25
Tstart (C) 50.40.40.40.60.
Tend (C) 265.260.250.240.300.
Heat rate (K/min) 2.52.2.4.3.
Initial hold (min) 1.5.5.
Final hold (min) 20.20.20.
I 1498.1504.1521.1524.1515.
ReferenceSarkhail, Amin, et al., 2004Senatore, Napolitano, et al., 2004Senatore, Rigano, et al., 2004Simic, Sokovic, et al., 2004Suyenaga, Apel, et al., 2004
Comment MSDC-RI MSDC-RI MSDC-RI MSDC-RI MSDC-RI
Column type CapillaryCapillaryCapillaryCapillaryCapillary
Active phase DB-5CP Sil 5 CBDB-5HP-5HP-5
Column length (m) 30.20.30.30.30.
Carrier gas HeHeHeN2He
Substrate
Column diameter (mm) 0.250.250.250.250.32
Phase thickness (μm) 0.250.250.250.250.25
Tstart (C) 60.100.60.60.100.
Tend (C) 240.270.300.220.240.
Heat rate (K/min) 3.8.3.5.5.
Initial hold (min)  2. 10.2.
Final hold (min)     5.
I 1520.1512.1522.1526.1524.
ReferenceTellez, Khan, et al., 2004Thappa, Bakshi, et al., 2004Tirillini, Pellegrino, et al., 2004Bertoli, Menichini, et al., 2003Chaves, Lago, et al., 2003
Comment MSDC-RI MSDC-RI MSDC-RI MSDC-RI MSDC-RI
Column type CapillaryCapillaryCapillaryCapillaryCapillary
Active phase HP-5MSRTX-5SilHP-5MSHP-1DB-1
Column length (m) 30.30.30.30.30.
Carrier gas HeHeHeHeN2
Substrate
Column diameter (mm) 0.250.250.250.250.25
Phase thickness (μm) 0.250.250.250.250.25
Tstart (C) 60.70.60.70.50.
Tend (C) 280.200.220.200.200.
Heat rate (K/min) 3.4.5.10.5.
Initial hold (min)   20.
Final hold (min)  10.20.
I 1522.1519.1532.1519.1505.
ReferenceCouladis, Özcan, et al., 2003Dudai, Larkov, et al., 2003Feizbaksh, Saber Tehrani, et al., 2003Fekam Boyom, Amvam Zollo, et al., 2003Fekam Boyom, Ngouana, et al., 2003
Comment MSDC-RI MSDC-RI MSDC-RI MSDC-RI MSDC-RI
Column type CapillaryCapillaryCapillaryCapillaryCapillary
Active phase HP-5MSHP-5MSMethyl SiliconeRSL-200RSL-200
Column length (m) 30.30.30.30.30.
Carrier gas HeHeHeH2H2
Substrate
Column diameter (mm) 0.250.250.320.320.32
Phase thickness (μm) 0.250.250.250.250.25
Tstart (C) 60.60.60.40.40.
Tend (C) 275.280.250.280.280.
Heat rate (K/min) 4.4.2.6.6.
Initial hold (min)   2.5.5.
Final hold (min)   5.5.5.
I 1523.1524.1518.1518.1515.
ReferenceGhannadi, Aghazari, et al., 2003Ghasemi, Asghari, et al., 2003Jayaprakasha, Rao, et al., 2003Jirovetz, Buchbauer, et al., 2003Jirovetz, Buchbauer, et al., 2003, 2
Comment MSDC-RI MSDC-RI MSDC-RI MSDC-RI MSDC-RI
Column type CapillaryCapillaryCapillaryCapillaryCapillary
Active phase DB-5CP Sil 5 CBCP Sil 5 CBDB-5DB-5MS
Column length (m) 50.25.25.30.30.
Carrier gas HeHeHeHeHe
Substrate
Column diameter (mm) 0.20.250.250.250.25
Phase thickness (μm) 0.250.250.390.250.25
Tstart (C) 50.35.60.60.60.
Tend (C) 220.280.220.250.240.
Heat rate (K/min) 3.5.5.3.3.
Initial hold (min) 2.2.5
Final hold (min) 10.
I 1520.1510.1518.1518.1524.
ReferenceJuteau, Jerkovic, et al., 2003Kanjilal, Kotoky, et al., 2003Khanavi, Hadjiakhoondi, et al., 2003Limberger, Simões-Pires, et al., 2003Maia, Taveira, et al., 2003
Comment MSDC-RI MSDC-RI MSDC-RI MSDC-RI MSDC-RI
Column type CapillaryCapillaryCapillaryCapillaryCapillary
Active phase DB-5DB-5DB-5DB-5CP Sil 5 CB
Column length (m) 30.30.30.50.25.
Carrier gas HeHeHeHe
Substrate
Column diameter (mm) 0.250.250.250.20.25
Phase thickness (μm) 0.250.250.250.250.39
Tstart (C) 60.60.60.50.60.
Tend (C) 280.280.280.220.220.
Heat rate (K/min) 3.3.3.3.5.
Initial hold (min)    2.
Final hold (min) 30.30.30.
I 1505.1512.1514.1524.1518.
ReferenceMarongiu, Porcedda, et al., 2003Marongiu, Porcedda, et al., 2003Marongiu, Porcedda, et al., 2003Masotti, Juteau, et al., 2003Mazloomifar, Saber-Tehrani, et al., 2003
Comment MSDC-RI MSDC-RI MSDC-RI MSDC-RI MSDC-RI
Column type CapillaryCapillaryCapillaryCapillaryCapillary
Active phase DB-1HP-5DB-5OV-101CP Sil 5 CB
Column length (m) 60.30.30.50.25.
Carrier gas HeHeliumHeHeH2
Substrate
Column diameter (mm) 0.250.320.250.20.25
Phase thickness (μm) 0.25 0.250.50.15
Tstart (C) 50.70.60.50.50.
Tend (C) 270.210.275.250.230.
Heat rate (K/min) 4.2.4.2.3.
Initial hold (min)   5.
Final hold (min)  60.
I 1513.1517.1521.1512.1507.
ReferenceMirza, Nik, et al., 2003Mookdasanit, Tamura, et al., 2003Morteza-Semnani and Saeedi, 2003Orav, Kailas, et al., 2003Oyedeji, Ekundayo, et al., 2003
Comment MSDC-RI MSDC-RI MSDC-RI MSDC-RI MSDC-RI
Column type CapillaryCapillaryCapillaryCapillaryCapillary
Active phase DB-1DB-5DB-5HP-5DB-1
Column length (m) 50.30.30.30.60.
Carrier gas N2H2H2HeHe
Substrate
Column diameter (mm) 0.250.250.250.250.25
Phase thickness (μm) 0.250.250.250.250.25
Tstart (C) 95.60.60.60.50.
Tend (C) 240.280.280.280.250.
Heat rate (K/min) 4.4.4.3.4.
Initial hold (min)  10.10.
Final hold (min)  40.40.
I 1516.1525.1525.1503.1510.
ReferencePerez-Alonso, Velasco-Negueruela, et al., 2003Pino, Marbot, et al., 2003Pino, Marbot, et al., 2003Pitarokili, Tzakou, et al., 2003Pourmortazavi, Sefidkon, et al., 2003
Comment MSDC-RI MSDC-RI MSDC-RI MSDC-RI MSDC-RI
Column type CapillaryCapillaryCapillaryCapillaryCapillary
Active phase NB-30DB-1DB-5HP-5HP-5
Column length (m) 50.60.30.30.30.
Carrier gas HeHeN2HeHe
Substrate
Column diameter (mm) 0.20.250.250.250.25
Phase thickness (μm) 0.50.250.250.250.25
Tstart (C) 50.40.40.60.60.
Tend (C) 250.220.230.280.280.
Heat rate (K/min) 2.4.2.4.4.
Initial hold (min)
Final hold (min)
I 1516.1514.1524.1524.1521.
ReferenceRaal, Arak, et al., 2003Rasooli and Mirmostafa, 2003Rotman, Ahumada, et al., 2003Sajjadi and Mehregan, 2003Sajjadi and Mehregan, 2003, 2
Comment MSDC-RI MSDC-RI MSDC-RI MSDC-RI MSDC-RI
Column type CapillaryCapillaryCapillaryCapillaryCapillary
Active phase DB-5DB-1DB-5HP-5HP-5
Column length (m) 30.60.30.60.60.
Carrier gas  HeHe
Substrate
Column diameter (mm) 0.250.250.250.250.25
Phase thickness (μm) 0.250.250.250.250.25
Tstart (C) 40.50.60.40.40.
Tend (C) 260.280.240.250.250.
Heat rate (K/min) 2.4.3.5.5.
Initial hold (min) 5.  15.15.
Final hold (min)
I 1520.1510.1524.1524.1524.
ReferenceSenatore and Bruno, 2003Shahmir, Ahmadi, et al., 2003da Silva, Luz, et al., 2003Stashenko, Jaramillo, et al., 2003Stashenko, Jaramillo, et al., 2003
Comment MSDC-RI MSDC-RI MSDC-RI MSDC-RI MSDC-RI
Column type CapillaryCapillaryCapillaryCapillaryCapillary
Active phase DB-5MSHP-5HP-5HP-5HP-5
Column length (m) 30.25.25.25.25.
Carrier gas HeH2H2HeliumHelium
Substrate
Column diameter (mm) 0.250.320.320.320.32
Phase thickness (μm) 0.250.530.530.530.53
Tstart (C) 60.40.40.40.40.
Tend (C) 240.280.280.280.280.
Heat rate (K/min) 3.4.4.4.4.
Initial hold (min)
Final hold (min)
I 1522.1519.1523.1519.1520.
ReferenceTaveira, de Lima, et al., 2003Velickovic, Randjelovic, et al., 2003Velickovic, Randjelovic, et al., 2003Velickovic, Ristic, et al., 2003Velickovic, Ristic, et al., 2003
Comment MSDC-RI MSDC-RI MSDC-RI MSDC-RI MSDC-RI
Column type CapillaryCapillaryCapillaryCapillaryCapillary
Active phase HP-5HP-5HP-5HP-5DB-5
Column length (m) 25.25.25.30.30.
Carrier gas HeliumHeliumHeliumHeHe
Substrate
Column diameter (mm) 0.320.320.320.250.25
Phase thickness (μm) 0.530.530.530.320.25
Tstart (C) 40.40.40.60.60.
Tend (C) 280.280.280.250.240.
Heat rate (K/min) 4.4.4.5.3.
Initial hold (min)    30.
Final hold (min)
I 1520.1521.1523.1530.1523.
ReferenceVelickovic, Ristic, et al., 2003Velickovic, Ristic, et al., 2003Velickovic, Ristic, et al., 2003Yassa, Akhani, et al., 2003Zoghbi, Andrade, et al., 2003
Comment MSDC-RI MSDC-RI MSDC-RI MSDC-RI MSDC-RI
Column type CapillaryCapillaryCapillaryCapillaryCapillary
Active phase DB-5DB-1DB-5OV-101HP-1
Column length (m) 25.60.30.25.30.
Carrier gas N2HeHe He
Substrate
Column diameter (mm) 0.250.250.2490.320.25
Phase thickness (μm) 0.250.250.25 0.25
Tstart (C) 50.50.60.50.70.
Tend (C) 250.280.300.200.220.
Heat rate (K/min) 4.4.3.5.3.
Initial hold (min)
Final hold (min) 10. 5. 15.
I 1524.1510.1521.1519.1508.
ReferenceZrira, Elamrani, et al., 2003Ahmadi, Mirza, et al., 2002Bos, Koulman, et al., 2002Boyom, Keumedjio, et al., 2002Cavaleiro, Salgueiro, et al., 2002
Comment MSDC-RI MSDC-RI MSDC-RI MSDC-RI MSDC-RI
Column type CapillaryCapillaryCapillaryCapillaryCapillary
Active phase 5 % Phenyl methyl siloxaneDB-5MSDB-5MSBP-1BPX-5
Column length (m) 30.30.30.25.
Carrier gas HeHeHeN2
Substrate
Column diameter (mm) 0.250.250.250.50
Phase thickness (μm) 0.250.250.250.25
Tstart (C) 75.60.60.60.40.
Tend (C) 200.280.280.220.260.
Heat rate (K/min) 3.3.3.5.5.
Initial hold (min) 4.
Final hold (min) 8.  10.
I 1523.1520.1520.1514.1531.
ReferenceCicció and Gómez-Laurito, 2002Congiu, Falconieri, et al., 2002Congiu, Falconieri, et al., 2002Das, Ram, et al., 2002Diaz and Kite, 2002
Comment MSDC-RI MSDC-RI MSDC-RI MSDC-RI MSDC-RI
Column type CapillaryCapillaryCapillaryCapillaryCapillary
Active phase DB-5DB-1PTE-5SE-30RSL-200
Column length (m) 30.30.60.50.30.
Carrier gas HeH2H2HeH2
Substrate
Column diameter (mm) 0.250.320.320.250.32
Phase thickness (μm) 0.250.250.300.250.25
Tstart (C) 60.40.60.70.40.
Tend (C) 240.245.285.240.280.
Heat rate (K/min) 3.3.4.34.6.
Initial hold (min)  20.  5.
Final hold (min)     5.
I 1526.1497.1524.1517.1519.
ReferenceFlamini, Ertugrul, et al., 2002Gancel, Ollé, et al., 2002Gudzic, Djokovic, et al., 2002Iñigo, Palá-Paúl, et al., 2002Jirovetz, Buchbauer, et al., 2002
Comment MSDC-RI MSDC-RI MSDC-RI MSDC-RI MSDC-RI
Column type CapillaryCapillaryCapillaryCapillaryCapillary
Active phase RSL-200CP Sil 8 CBDB-5DB-1DB-5
Column length (m) 30.30.30.25.30.
Carrier gas H2He HeHe
Substrate
Column diameter (mm) 0.250.250.250.230.25
Phase thickness (μm) 0.250.250.250.200.25
Tstart (C) 40.50.40.50.60.
Tend (C) 280.220.210.200.240.
Heat rate (K/min) 6.3.2.3.3.
Initial hold (min) 2.2.2.3.
Final hold (min) 10. 33.30.
I 1519.1524.1529.1527.1521.
ReferenceJirovetz, Smith, et al., 2002Juteau, Masotti, et al., 2002Kabouss, Charrouf, et al., 2002Khallouki, Younos, et al., 2002Kobaisy, Tellez, et al., 2002
Comment MSDC-RI MSDC-RI MSDC-RI MSDC-RI MSDC-RI
Column type CapillaryCapillaryCapillaryCapillaryCapillary
Active phase DB-5DB-5OV-101HP-5DB-5
Column length (m) 30.30.25.30.30.
Carrier gas HeHeHe He
Substrate
Column diameter (mm) 0.250.250.320.320.25
Phase thickness (μm) 0.250.25 0.250.25
Tstart (C) 35.35.50.100.60.
Tend (C) 280.280.200.240.250.
Heat rate (K/min) 3.4.5.5.3.
Initial hold (min) 2.2. 2.
Final hold (min) 15.15. 5.
I 1530.1531.1518.1519.1517.
ReferenceKrauze-Baranowska, Mardarowicz, et al., 2002Krauze-Baranowska, Mardarowicz, et al., 2002, 2Kuiate, Bessière, et al., 2002Lago, Reis, et al., 2002Limberger, Simões-Pires, et al., 2002
Comment MSDC-RI MSDC-RI MSDC-RI MSDC-RI MSDC-RI
Column type CapillaryCapillaryCapillaryCapillaryCapillary
Active phase HP-5DB-5DB-5DB-5MSOV-101
Column length (m) 30.25.30.30.25.
Carrier gas  N2HeHeHe
Substrate
Column diameter (mm) 0.250.230.250.250.32
Phase thickness (μm) 0.250.150.250.25
Tstart (C) 60.50.60.60.50.
Tend (C) 275.250.240.240.200.
Heat rate (K/min) 4.3.3.3.5.
Initial hold (min) 4.
Final hold (min)
I 1517.1520.1526.1527.1521.
ReferenceLockwood, Asghari, et al., 2002Mahmout, Bessière, et al., 2002Maia, da Silva, et al., 2002Maia, Zoghbi, et al., 2002Menut, Bessière, et al., 2002
Comment MSDC-RI MSDC-RI MSDC-RI MSDC-RI MSDC-RI
Column type CapillaryCapillaryCapillaryCapillaryCapillary
Active phase DB-1OV-101DB-5MSDB-5DB-1
Column length (m) 30.50.30.25.60.
Carrier gas HeHeHeHeHe
Substrate
Column diameter (mm) 0.250.20.320.20.25
Phase thickness (μm) 0.250.50.25
Tstart (C) 60.50.40.60.40.
Tend (C) 250.250.280.220.250.
Heat rate (K/min) 4.2.4.3.4.
Initial hold (min) 10.
Final hold (min)   5.
I 1528.1509.1522.1522.1506.
ReferenceNorouzi-Arasi, Yavari, et al., 2002Orav, Kailas, et al., 2002Phutdhawong, Korth, et al., 2002Schwob, Bessière, et al., 2002Sefidkon, Dabiri, et al., 2002
Comment MSDC-RI MSDC-RI MSDC-RI MSDC-RI MSDC-RI
Column type CapillaryCapillaryCapillaryCapillaryCapillary
Active phase DB-1HP-5DB-5MSDB-5DB-1
Column length (m) 50.30.30.30.60.
Carrier gas N2H2HeHeN2
Substrate
Column diameter (mm) 0.250.250.250.250.248
Phase thickness (μm) 0.250.250.250.250.25
Tstart (C) 60.40.60.60.60.
Tend (C) 240.280.270.240.220.
Heat rate (K/min) 3.4.3.3.3.
Initial hold (min)     5.
Final hold (min)     22.
I 1497.1524.1525.1524.1520.
ReferenceVelasco-Negueruela, Pérez-Alonso, et al., 2002Velickovic, Randjelovic, et al., 2002Zoghbi, Andrade, et al., 2002Zoghbi, Andrade, et al., 2002, 2Bailac, Dellacasa, et al., 2001
Comment MSDC-RI MSDC-RI MSDC-RI MSDC-RI MSDC-RI
Column type CapillaryCapillaryCapillaryCapillaryCapillary
Active phase SPB-5DB-1DB-1HP-5HP-5
Column length (m) 60.60.60.30.30.
Carrier gas HeHeHeN2N2
Substrate
Column diameter (mm) 0.320.250.250.250.25
Phase thickness (μm)  0.250.250.250.25
Tstart (C) 40.40.40.60.60.
Tend (C) 220.280.280.220.220.
Heat rate (K/min) 3.4.4.5.5.
Initial hold (min) 5.5.5.10.10.
Final hold (min) 15.
I 1526.1511.1511.1523.1524.
ReferenceCornu, Carnat, et al., 2001Dabiri and Sefidkon, 2001Dabiri and Sefidkon, 2001Flamini, Cioni, et al., 2001Gallori, Flamini, et al., 2001
Comment MSDC-RI MSDC-RI MSDC-RI MSDC-RI MSDC-RI
Column type CapillaryCapillaryCapillaryCapillaryCapillary
Active phase BP-1Optima-5RTX-1DB-5MSDB-1
Column length (m) 30.30.30.30.60.
Carrier gas N2HeN2HeHe
Substrate
Column diameter (mm) 0.250.20.250.250.25
Phase thickness (μm) 0.25 0.250.250.25
Tstart (C) 60.50.60.60.50.
Tend (C) 220.250.300.240.270.
Heat rate (K/min) 5.3.4.3.4.
Initial hold (min)  3.
Final hold (min)    30.
I 1518.1527.1516.1515.1509.
ReferenceGupta, Mallavarapu, et al., 2001Jacquemond-Collet, Bessière, et al., 2001Kalemba, Marschall, et al., 2001Marongiu, Porcedda, et al., 2001Mirza, Ahmadi, et al., 2001
Comment MSDC-RI MSDC-RI MSDC-RI MSDC-RI MSDC-RI
Column type CapillaryCapillaryCapillaryCapillaryCapillary
Active phase OV-101OV-101DB-5DB-1DB-5
Column length (m) 50.50.30.30.60.
Carrier gas HeHeHeN2He
Substrate
Column diameter (mm) 0.20.20.250.250.25
Phase thickness (μm)   0.250.25
Tstart (C) 50.50.60.80.50.
Tend (C) 250.250.270.225.250.
Heat rate (K/min) 2.2.3.4.3.
Initial hold (min)     5.
Final hold (min)
I 1509.1508.1523.1504.1524.
ReferenceOrav and Kann, 2001Orav and Kann, 2001Palmeira, Conserva, et al., 2001Palá-Paúl, Pérez-Alonso, et al., 2001Rousis, Papadogianni, et al., 2001
Comment MSDC-RI MSDC-RI MSDC-RI MSDC-RI MSDC-RI
Column type CapillaryCapillaryCapillaryCapillaryCapillary
Active phase DB-5CP Sil 5 CBCP-Sil 5 CBDB-5OV-101
Column length (m) 30.25.25.30.50.
Carrier gas H2HeNitrogenHeN2
Substrate
Column diameter (mm) 0.250.250.250.250.25
Phase thickness (μm) 0.250.390.390.25
Tstart (C) 60.60.60.60.80.
Tend (C) 285.220.220.240.200.
Heat rate (K/min) 3.5.5.3.2.
Initial hold (min)
Final hold (min)
I 1520.1522.1522.1522.1517.
ReferenceSantos-Gomes and Fernandes-Ferreira, 2001Sayyah, Kamalinejad, et al., 2001Sayyah, Kamalinejad, et al., 2001, 2Tellez M., Estell R., et al., 2001Yang, 2001
Comment MSDC-RI MSDC-RI MSDC-RI MSDC-RI MSDC-RI
Column type CapillaryCapillaryCapillaryCapillaryCapillary
Active phase OV-101DB-1HP-5DB-1RSL-200
Column length (m) 50.60.30.30.60.
Carrier gas N2N2H2 H2
Substrate
Column diameter (mm) 0.250.250.250.320.32
Phase thickness (μm)  0.250.250.250.25
Tstart (C) 80.60.40.45.40.
Tend (C) 200.220.280.300.250.
Heat rate (K/min) 2.3.3.15.6.
Initial hold (min)  5.10.2.
Final hold (min)  22.10.5.
I 1517.1528.1523.1505.1516.
ReferenceYang, 2001, 2Bailac, Dellacasa, et al., 2000Bicalho, Pereira, et al., 2000Hedin, McKibben, et al., 2000Jirovetz, Puschmann, et al., 2000
Comment MSDC-RI MSDC-RI MSDC-RI MSDC-RI MSDC-RI
Column type CapillaryCapillaryCapillaryCapillaryCapillary
Active phase DB-1HP-1HP-5OV-101DB-5
Column length (m) 25.60.30.50.30.
Carrier gas NitrogenHeHeNitrogenHe
Substrate
Column diameter (mm) 0.500.250.250.250.25
Phase thickness (μm) 0.250.250.25 0.25
Tstart (C) 60.60.40.40.60.
Tend (C) 220.200.240.200.240.
Heat rate (K/min) 5.4.3.2.3.
Initial hold (min)  5.5.10.
Final hold (min)  25.
I 1512.1517.1533.1516.1523.
ReferenceMallavarapu, Rao, et al., 2000Meccia, Rojas, et al., 2000Novak, Novak, et al., 2000Tamura, Boonbumrung, et al., 2000Tellez, Dayan, et al., 2000
Comment MSDC-RI MSDC-RI MSDC-RI MSDC-RI MSDC-RI
Column type CapillaryCapillaryCapillaryCapillaryCapillary
Active phase CP Sil 5 CBOV-101OV-101RTX-1Ultra-2
Column length (m) 25.25.52.30.50.
Carrier gas H2N2HeliumN2
Substrate
Column diameter (mm) 0.250.250.260.250.32
Phase thickness (μm) 0.15 0.130.25
Tstart (C) 50.50.50.60.32.
Tend (C) 320.200.220.300.250.
Heat rate (K/min) 3.5.3.4.4.
Initial hold (min)   0. 5.
Final hold (min)   0.
I 1507.1518.1517.1518.1512.
ReferenceAsekun and Ekundayo, 1999Ayedoun, Adéoti, et al., 1999Dzumayev, Tkachenko, et al., 1999Kalemba, 1999Khalilov L.M., Khalilova A.Z., et al., 1999
Comment MSDC-RI MSDC-RI MSDC-RI MSDC-RI MSDC-RI
Column type CapillaryCapillaryCapillaryCapillaryCapillary
Active phase DB-1OV-101CBP-1HP-1BP-1
Column length (m) 25.25.25.25.25.
Carrier gas He HeH2N2
Substrate
Column diameter (mm) 0.250.320.30.320.50
Phase thickness (μm) 0.25  0.170.25
Tstart (C) 50.50.60.40.60.
Tend (C) 290.200.240.260.220.
Heat rate (K/min) 4.5.4.3.5.
Initial hold (min)    5.
Final hold (min)     10.
I 1521.1518.1517.1506.1514.
ReferenceKoulman, 1999Kuiate, Zollo, et al., 1999Labuckas, Zygadlo, et al., 1999Lopes, Koketsu, et al., 1999Mallavarapu, Kulkarni, et al., 1999
Comment MSDC-RI MSDC-RI MSDC-RI MSDC-RI MSDC-RI
Column type CapillaryCapillaryCapillaryCapillaryCapillary
Active phase OV-1CP Sil 5 CBDB-1SE-30CP Sil 5 CB
Column length (m) 25.25.50.30.25.
Carrier gas H2HeHeHeliumHe
Substrate
Column diameter (mm) 0.250.250.250.250.25
Phase thickness (μm) 0.25 0.250.200.39
Tstart (C) 40.50.70.60.60.
Tend (C) 220.230.240.200.220.
Heat rate (K/min) 3.3.4.3.5.
Initial hold (min) 5.  4.5.
Final hold (min) 5.   20.
I 1501.1531.1504.1541.1516.
ReferenceOberhofer, Nikiforov, et al., 1999Oyedeji, Olawore, et al., 1999Palá-Paúl, Pérez-Alonso, et al., 1999Prikhod'ko, Klyuev, et al., 1999Rustaiyan, Masoudi, et al., 1999
Comment MSDC-RI MSDC-RI MSDC-RI MSDC-RI MSDC-RI
Column type CapillaryCapillaryCapillaryCapillaryCapillary
Active phase DB-1DB-5DB-1DB-5OV-101
Column length (m) 60.30.60.30.50.
Carrier gas HeHeHeHeHe
Substrate
Column diameter (mm) 0.250.250.250.250.22
Phase thickness (μm) 0.250.250.250.251.
Tstart (C) 40.40.50.60.100.
Tend (C) 280.220.220.240.220.
Heat rate (K/min) 4.4.4.3.1.
Initial hold (min) 5.5.  1.
Final hold (min)
I 1511.1526.1526.1523.1508.
ReferenceSefidkon, Dabiri, et al., 1999Sefidkon and Khajavi, 1999Sefidkon and Mirza, 1999Tellez, Canel, et al., 1999Camciuc, Bessière, et al., 1998
Comment MSDC-RI MSDC-RI MSDC-RI MSDC-RI MSDC-RI
Column type CapillaryCapillaryCapillaryCapillaryCapillary
Active phase SPB-5DB-5SE-30OV-1DB-5
Column length (m) 50.30.25.50.30.
Carrier gas HeHeHeHeHe
Substrate
Column diameter (mm) 0.320.250.20.320.25
Phase thickness (μm) 0.250.25 0.250.25
Tstart (C) 60.60.60.50.60.
Tend (C) 240.240.180.250.240.
Heat rate (K/min) 3.3.3.10.3.
Initial hold (min)   10.5.
Final hold (min) 20.  20.
I 1530.1520.1524.1516.1527.
ReferenceDoneanu and Anitescu, 1998El-Sakhawy, El-Tantawy, et al., 1998Jantan, Ahmad, et al., 1998Kökdil, Kurucu, et al., 1998Maia, Zohhbi, et al., 1998
Comment MSDC-RI MSDC-RI MSDC-RI MSDC-RI MSDC-RI
Column type CapillaryCapillaryCapillaryCapillaryCapillary
Active phase HP-101HP-5HP-1OV-101CP Sil 5 CB
Column length (m) 25.25.60.25.25.
Carrier gas HeHeHe N2
Substrate
Column diameter (mm) 0.20.20.250.320.32
Phase thickness (μm) 0.20.330.25 0.25
Tstart (C) 70.70.50.50.50.
Tend (C) 200.290.280.200.290.
Heat rate (K/min) 3.3.4.5.4.
Initial hold (min) 2.8.5.
Final hold (min) 10.20.
I 1504.1529.1497.1518.1507.
ReferenceMilso, Mastelic, et al., 1998Poiana, Sicari, et al., 1998Stashenko, Cervantes, et al., 1998Zollo, Biyiti, et al., 1998Bos, Woerdenbag, et al., 1997
Comment MSDC-RI MSDC-RI MSDC-RI MSDC-RI MSDC-RI
Column type CapillaryCapillaryCapillaryCapillaryCapillary
Active phase CP Sil 5 CBDB-5OV-1OV-1DB-1
Column length (m) 25.30.30.30.
Carrier gas HeHeHe
Substrate
Column diameter (mm) 0.250.250.320.32
Phase thickness (μm) 0.250.250.250.25
Tstart (C) 60.65.40.40.80.
Tend (C) 300.300.270.270.220.
Heat rate (K/min) 6.4.2.2.6.
Initial hold (min)  2.4.4.
Final hold (min)
I 1507.1528.1514.1501.1505.
ReferenceBos, Woerdenbag, et al., 1997, 2Elias, Simoneit, et al., 1997Kökdil, Kurucu, et al., 1997Kökdil, Tanker, et al., 1997Salgueiro, Vila, et al., 1997
Comment MSDC-RI MSDC-RI MSDC-RI MSDC-RI MSDC-RI
Column type CapillaryCapillaryCapillaryCapillaryCapillary
Active phase DB-5DB-5CBP-1HP-1OV-101
Column length (m) 30.30.25.23.50.
Carrier gas HeliumHeHeHeN2
Substrate
Column diameter (mm) 0.250.250.220.320.25
Phase thickness (μm) 0.25  0.170.17
Tstart (C) 60.60.60.60.50.
Tend (C) 240.240.240.250.220.
Heat rate (K/min) 3.4.5.5.5.
Initial hold (min)    3.
Final hold (min)    30.
I 1523.1521.1517.1510.1526.
ReferenceTellez, Estell, et al., 1997Zunino, Novillo-Newton, et al., 1997Zygadlo, Ariza-Espinar, et al., 1997Ayedoun, Adeoti, et al., 1996Chacko, Jayalekshmy, et al., 1996
Comment MSDC-RI MSDC-RI MSDC-RI MSDC-RI MSDC-RI
Column type CapillaryCapillaryCapillaryCapillaryCapillary
Active phase OV-101DB-1DB-1HP-1SPB-1
Column length (m) 50.60.60.25.50.
Carrier gas HeHeHeHeliumHe
Substrate
Column diameter (mm) 0.250.320.250.320.2
Phase thickness (μm)  0.500.250.250.33
Tstart (C) 50.50.50.60.40.
Tend (C) 250.250.250.220.200.
Heat rate (K/min) 2.8.2.54.3.
Initial hold (min)  1.5.2.3.
Final hold (min)  6. 20.30.
I 1510.1528.1522.1510.1512.
ReferenceOrav, Kailas, et al., 1996Sagrero-Nieves and Bartley, 1996Stashenko, Puertas, et al., 1996Thanh, Dung, et al., 1996Wong and Lai, 1996
Comment MSDC-RI MSDC-RI MSDC-RI MSDC-RI MSDC-RI
Column type CapillaryCapillaryCapillaryCapillaryCapillary
Active phase DB-1DB-1DB-1OV-1OV-1
Column length (m) 60.60.60.50.50.
Carrier gas HeHeHeN2N2
Substrate
Column diameter (mm) 0.320.250.250.270.27
Phase thickness (μm) 0.250.250.250.20.2
Tstart (C) 80.50.70.80.80.
Tend (C) 210.250.270.240.240.
Heat rate (K/min) 4.3.52.53.3.
Initial hold (min)  5.5.
Final hold (min)
I 1512.1515.1511.1515.1529.
ReferenceNishimura, 1995Stashenko, Torres, et al., 1995Tirado, Stashenko, et al., 1995Ramanoelina, Viano, et al., 1994Ramanoelina, Viano, et al., 1994
Comment MSDC-RI MSDC-RI MSDC-RI MSDC-RI MSDC-RI
Column type CapillaryCapillaryCapillaryCapillaryCapillary
Active phase HP-101Methyl SiliconeMethyl SiliconeCP Sil 5 CBDB-1
Column length (m) 50.50.50.25.30.
Carrier gas H2N2N2 He
Substrate
Column diameter (mm) 0.320.250.250.250.25
Phase thickness (μm) 0.30.170.17 0.25
Tstart (C) 65.80.80.60.50.
Tend (C) 300.200.200.280.240.
Heat rate (K/min) 2.2.3.5.5.
Initial hold (min) 5.   3.
Final hold (min)
I 1508.1524.1523.1518.1516.
ReferenceDemarne and van der Walt, 1993Gopalakrishnan, Menon, et al., 1993Gopalakrishnan, Menon, et al., 1993Kaul, Singh, et al., 1993Shiota, 1993
Comment MSDC-RI MSDC-RI MSDC-RI MSDC-RI MSDC-RI
Column type CapillaryCapillaryCapillaryCapillaryCapillary
Active phase DB-1SE-54DB-1DB-1DB-1
Column length (m) 30.30.30.60.60.
Carrier gas HeHydrogenN2
Substrate
Column diameter (mm) 0.250.25 0.320.32
Phase thickness (μm) 0.250.25
Tstart (C) 50.60.80.50.50.
Tend (C) 240.250.220.230.230.
Heat rate (K/min) 5.2.4.4.4.
Initial hold (min) 3.5.
Final hold (min)  2. 10.10.
I 1519.1517.1501.1513.1513.
ReferenceShiota, 1993Kollmannsberger, Nitz, et al., 1992Velasco-Negueruela, Pérez Alonso, et al., 1991Binder, Benson, et al., 1990Binder, Turner, et al., 1990
Comment MSDC-RI MSDC-RI MSDC-RI MSDC-RI MSDC-RI
Column type CapillaryCapillaryCapillaryCapillaryCapillary
Active phase CP Sil 8 CBRSL-150BP-1OV-101OV-101
Column length (m) 25.30.25.50.50.
Carrier gas    N2N2
Substrate
Column diameter (mm) 0.200.320.330.250.25
Phase thickness (μm)  0.20
Tstart (C) 60.30.45.80.80.
Tend (C) 230.200.180.200.200.
Heat rate (K/min) 3.3.3.2.2.
Initial hold (min) 10. 3.
Final hold (min)
I 1550.1515.1506.1516.1516.
ReferenceJantan and Goh, 1990Ronse and De Pooter, 1990Wyllie, Brophy, et al., 1990Yang and Sugisawa, 1990Yang and Sugisawa, 1990
Comment MSDC-RI MSDC-RI MSDC-RI MSDC-RI MSDC-RI
Column type CapillaryCapillaryCapillaryCapillaryCapillary
Active phase DB-1BP-1SE-30OV-101OV-101
Column length (m) 60.50.40.50.50.
Carrier gas  H2HeN2N2
Substrate
Column diameter (mm) 0.320.300.500.250.25
Phase thickness (μm)   0.75
Tstart (C) 50.40.30.80.80.
Tend (C) 250.250.220.200.200.
Heat rate (K/min) 4.10.3.2.2.
Initial hold (min) 0.11.
Final hold (min) 5.
I 1512.1520.1510.1517.1516.
ReferenceBinder and Flath, 1989Brophy, Davies, et al., 1989de Pooter, de Buyck, et al., 1989Sugisawa, Yamamoto, et al., 1989Sugisawa, Yang, et al., 1989
Comment MSDC-RI MSDC-RI MSDC-RI MSDC-RI MSDC-RI
Column type CapillaryCapillaryCapillaryCapillaryCapillary
Active phase OV-101DB-1DB-1SE-54OV-1
Column length (m) 50.60.60.25.50.
Carrier gas N2HeHeN2He
Substrate
Column diameter (mm) 0.250.320.320.250.20
Phase thickness (μm)     0.20
Tstart (C) 80.30.30.60.30.
Tend (C) 200.210.210.260.220.
Heat rate (K/min) 2.2.2.6.2.
Initial hold (min)  4.4.2.
Final hold (min)
I 1516.1508.1513.1533.1512.
ReferenceSugisawa, Yang, et al., 1989Takeoka and Butter, 1989Takeoka and Butter, 1989Bestmann, Classen, et al., 1988de Pooter, Nicolai, et al., 1988
Comment MSDC-RI MSDC-RI MSDC-RI MSDC-RI MSDC-RI
Column type CapillaryCapillaryCapillaryCapillaryCapillary
Active phase SE-30OV-101OV-101OV-101DB-1
Column length (m) 30.50.50.50.10.
Carrier gas     H2
Substrate
Column diameter (mm)  0.300.300.300.25
Phase thickness (μm)     0.25
Tstart (C) 50.40.40.40.50.
Tend (C) 240.230.230.230.250.
Heat rate (K/min) 4.3.53.53.55.
Initial hold (min) 2.5.5.5.
Final hold (min) 10.
I 1510.1514.1527.1535.1515.
ReferenceRamaswami, Briscese, et al., 1988Nykanen, 1986Nykanen, 1986Nykanen, 1986Perry, Baxter, et al., 1986
Comment MSDC-RI MSDC-RI MSDC-RI MSDC-RI MSDC-RI
Column type CapillaryCapillaryCapillaryCapillaryCapillary
Active phase OV-1OV-101OV-101OV-101SE-30
Column length (m) 40.30.30.30.30.
Carrier gas HeHeHeHe
Substrate
Column diameter (mm) 0.50.50.50.5
Phase thickness (μm) 0.750.80.80.8
Tstart (C) 30.40.40.40.50.
Tend (C) 220.220.220.220.240.
Heat rate (K/min) 3.2.2.2.4.
Initial hold (min)     2.
Final hold (min)     10.
I 1512.1511.1511.1511.1510.
Referencede Pooter, de Buyck, et al., 1986De Pooter and Schamp, 1986De Pooter and Schamp, 1986De Pooter and Schamp, 1986Ramaswami, Briscese, et al., 1986
Comment MSDC-RI MSDC-RI MSDC-RI MSDC-RI MSDC-RI
Column type CapillaryCapillaryCapillary
Active phase OV-3SE-30+IgepalSE-30+Igepal
Column length (m) 150.100.100.
Carrier gas
Substrate
Column diameter (mm) 0.660.250.25
Phase thickness (μm)
Tstart (C) 20.70.70.
Tend (C) 170.170.170.
Heat rate (K/min) 1.1.1.
Initial hold (min)
Final hold (min)
I 1540.1518.1519.
ReferenceButtery, Xu, et al., 1985Shibamoto and Jennings, 1977Shibamoto and Jennings, 1977
Comment MSDC-RI MSDC-RI MSDC-RI

Van Den Dool and Kratz RI, non-polar column, custom temperature program

Data compiled by: NIST Mass Spectrometry Data Center, William E. Wallace, director

Column type CapillaryCapillaryCapillaryCapillaryCapillary
Active phase DB-5BPX-5BP-5CBP-5BPX-5
Column length (m) 30.30.25.30.30.
Carrier gas HeHeHeHe
Substrate
Column diameter (mm) 0.250.250.220.250.25
Phase thickness (μm) 0.250.250.250.250.25
Program 40C(2min) => 4C/min => 220C => 20C/min => 280C35C => 4C/min => 200C => 30C/min => 300C (3min)30C(1min) => 50C/min => 105C => 1.5C/min => 150C => 30C/min => 280C (10min)60C => 3C/min => 246C => 10C/min => 270C (5min)35C(5min) => 3C/min => 210C => 40C/min => 240C (4min)
I 1526.1528.1522.1523.1533.
ReferenceAndrade, Sampaio, et al., 2007Dharmawan, Kasapis, et al., 2007Sant'Anna, Fontes, et al., 2007Silva, Oliveira, et al., 2007Cardeal, da Silva, et al., 2006
Comment MSDC-RI MSDC-RI MSDC-RI MSDC-RI MSDC-RI
Column type CapillaryCapillaryCapillaryCapillaryCapillary
Active phase DB-5SE-52DB-1SE-52SE-52
Column length (m) 30.30.30.30.25.
Carrier gas HeHeHeHeH2
Substrate
Column diameter (mm) 0.320.320.250.320.32
Phase thickness (μm) 0.250.150.250.150.43
Program 40C(3min) => 3C/min => 180C => 10C/min => 260C(2min)45C => 1C/min => 100C => 5C/min => 250C(10min)35C => 2C/min => 200C => 5C/min => 240C45C => 1C/min => 100C => 5C/min => 250C(10min)60C(8min) => 3C/min => 180C => 20C/min => 250C(10min)
I 1518.1523.1495.1523.1512.
ReferenceMoon, Cliff, et al., 2006Sacchetti, Guerrini, et al., 2006Suliman F.E.O., Fatope M.O., et al., 2006Bruni, Pellati, et al., 2005Lorenzo, Paz, et al., 2005
Comment MSDC-RI MSDC-RI MSDC-RI MSDC-RI MSDC-RI
Column type CapillaryCapillaryCapillaryCapillaryCapillary
Active phase CBP-55 % Phenyl methyl siloxaneDB-5MSSE-52CP-Sil5 CB MS
Column length (m) 30.30.30.25.60.
Carrier gas HeHeHeH2He
Substrate
Column diameter (mm) 0.250.320.250.320.32
Phase thickness (μm) 0.250.150.250.430.25
Program 60C => 3C/min => 240C => 10C/min => 280C(10min)45C => 1C/min => 100C => 5C/min => 250C (10min)40 (5min) => 4C/min => 140C => 4C/min => 200C (20min)60C(8min) => 3C/min => 180C => 20C/min => 250C(10min)40C(1min) => 25C/min => 120C => 2C/min => 190C => 25C/min => 250C (5min)
I 1521.1523.1516.1520.1507.1
ReferenceOliveira, Campos, et al., 2005Sacchetti, Maietti, et al., 2005Zheng, Kim, et al., 2005Frizzo, Lorenzo, et al., 2004Helmig, Bocquet, et al., 2004
Comment MSDC-RI MSDC-RI MSDC-RI MSDC-RI MSDC-RI
Column type CapillaryCapillaryCapillaryCapillaryCapillary
Active phase SE-52SE-52DB-5MSCP Sil 8 CBCBP-5
Column length (m) 25.30.30.50.50.
Carrier gas  HeHeHeHe
Substrate
Column diameter (mm) 0.320.520.250.320.25
Phase thickness (μm) 0.40.150.25 0.25
Program 60C(8min) => 3C/min => 180C => 20C/min => 250C(10min)45C => 1C/min => 100C => 5C/min => 250C (10min)40C(5min) => 4C/min => 160C => 8C/min => 240C (15min)60C (2min) => 5C/min => 160C (1min) => 10C/min => 250C (2min)60C(2min) => 3C/min => 240C => 10C/min => 280C(10min)
I 1522.1523.1528.1524.1520.
ReferenceLorenzo, Paz, et al., 2004Sacchetti, Medici, et al., 2004Kim, Lee, et al., 2003Mockute and Judzentiene, 2003Azevedo, Campos, et al., 2002
Comment MSDC-RI MSDC-RI MSDC-RI MSDC-RI MSDC-RI
Column type CapillaryCapillaryCapillaryCapillaryCapillary
Active phase HP-5BP-1SE-52SE-52DB-1
Column length (m) 50.50.30.25.60.
Carrier gas He H2HeHe
Substrate
Column diameter (mm) 0.20.220.320.250.25
Phase thickness (μm) 0.330.250.400.250.25
Program 50C(2min) => 5C/min => 150C => 10C/min => 250C(30min)not specified60 0C (8 min) 3 K/min -> 180 0C 20 K/min -> 250 0C (10 min)60 0C (8 min) 3 K/min -> 180 0C 20 K/min -> 230 0C-20C (5min) => 10C/min => 100C => 4C/min => 200C => 10C/min => 280C
I 1540.1515.1521.1517.1516.
ReferenceGarcía, Alvarez, et al., 2002Cavalli, Ranarivelo, et al., 2001Lorenzo, Paz, et al., 2001Lorenzo, Saavedra, et al., 2001Eri, Khoo, et al., 2000
Comment MSDC-RI MSDC-RI MSDC-RI MSDC-RI MSDC-RI
Column type CapillaryCapillaryCapillaryCapillary
Active phase BP-1HP-5SE-52BPX-5
Column length (m)  30.25.50.
Carrier gas   HeHe
Substrate
Column diameter (mm)  0.250.250.32
Phase thickness (μm)  0.250.250.5
Program not specified40C(1min) => 3C/min => 120C => 5C/min => 280C60C(8min) => 3C/min => 180C => 20C/min => 230C0C (5min) => 40C/min => 40C (2min) => 10C/min => 280C
I 1516.1523.1521.1556.
ReferenceFilippini, Tomi, et al., 2000Isidorov, Krajewska, et al., 2000Lorenzo, Dellacassa, et al., 2000Elmore, Erbahadir, et al., 1997
Comment MSDC-RI MSDC-RI MSDC-RI MSDC-RI

Kovats' RI, polar column, temperature ramp

Data compiled by: NIST Mass Spectrometry Data Center, William E. Wallace, director

Column type CapillaryCapillaryCapillaryCapillaryCapillary
Active phase StabilwaxSupelcowax-10HP-WaxDB-WaxDB-Wax
Column length (m) 30.30.50.30.30.
Carrier gas N2 HeHe
Substrate
Column diameter (mm) 0.320.250.20.320.25
Phase thickness (μm) 1.0.250.40.250.25
Tstart (C) 50.40.60.40.40.
Tend (C) 220.210.230.220.240.
Heat rate (K/min) 2.2.4.3.2.
Initial hold (min) 3.2. 5.
Final hold (min) 15.33.30. 40.
I 1772.1758.1781.1742.1730.
ReferenceHazzit, Baaliouamer, et al., 2006Sylvestre, Pichette, et al., 2006Gauvin, Lecomte, et al., 2004Lopes, Strobl, et al., 2004Nébié, Yaméogo, et al., 2004
Comment MSDC-RI MSDC-RI MSDC-RI MSDC-RI MSDC-RI
Column type CapillaryCapillaryCapillaryCapillaryCapillary
Active phase InnowaxSupelcowax-10Carbowax 20MCarbowaxSupelcowax-10
Column length (m) 30.30.25.30.30.
Carrier gas HeHeN2Ar
Substrate
Column diameter (mm) 0.250.320.50.25
Phase thickness (μm) 0.250.25 0.25
Tstart (C) 50.75.60.50.40.
Tend (C) 250.230.200.220.210.
Heat rate (K/min) 0.53.5.4.2.
Initial hold (min) 5.   2.
Final hold (min) 10.   120.
I 1751.1761.1763.1761.1754.
ReferenceViña and Murillo, 2003Tzakou and Couladis, 2001Mallavarapu, Rao, et al., 1998Szafranek, Malinski, et al., 1998Loayza, Abujder, et al., 1995
Comment MSDC-RI MSDC-RI MSDC-RI MSDC-RI MSDC-RI
Column type CapillaryCapillaryCapillaryCapillaryCapillary
Active phase Supelcowax-10Supelcowax-10DB-WaxSupelcowax-10Carbowax 20M
Column length (m) 30.30.60.60.50.
Carrier gas   HeHeHe
Substrate
Column diameter (mm)   0.250.250.3
Phase thickness (μm)
Tstart (C) 40.40.40.35.70.
Tend (C) 210.210.200.200.210.
Heat rate (K/min) 2.2.2.3.2.
Initial hold (min) 2.2.2.5.
Final hold (min) 120.120. 20.
I 1743.1744.1753.1760.1738.
ReferenceLoayza, Abujder, et al., 1995Loayza, Abujder, et al., 1995Umano, Hagi, et al., 1994Wong and Tie, 1993Randriamiharisoa and Gaydou, 1987
Comment MSDC-RI MSDC-RI MSDC-RI MSDC-RI MSDC-RI
Column type CapillaryCapillaryCapillaryCapillaryCapillary
Active phase BP-20Carbowax 20MCarbowax 20MCarbowax 20MCarbowax 20M
Column length (m) 25.50.100.100.50.
Carrier gas  H2  He
Substrate
Column diameter (mm) 0.3320.30.280.280.28
Phase thickness (μm)  0.15
Tstart (C) 70.70.80.80.70.
Tend (C) 200.210.200.200.190.
Heat rate (K/min) 4.2.3.3.2.
Initial hold (min) 2.
Final hold (min)
I 1766.1730.1721.1722.1754.
ReferenceWyllie, Cook, et al., 1987Gaydou, Randriamiharisoa, et al., 1986Bernhard, Shibamoto, et al., 1983Bernhard, Shibamoto, et al., 1983Tressl, Friese, et al., 1978
Comment MSDC-RI MSDC-RI MSDC-RI MSDC-RI MSDC-RI

Kovats' RI, non-polar column, isothermal

Data compiled by: NIST Mass Spectrometry Data Center, William E. Wallace, director

Column type CapillaryCapillaryCapillaryPackedPacked
Active phase EC-1DB-1OV-101SF-96Apiezon L
Column length (m) 30.28. 7.37.3
Carrier gas  He
Substrate
Column diameter (mm) 0.250.25
Phase thickness (μm) 0.250.25
Temperature (C) 130.150.130.170.190.
I 1505.1518.1510.1526.1562.
ReferenceSzafranek, Chrapkowska, et al., 2005Viswanathan, Maridass, et al., 2002Clarke, Perry, et al., 1994Andersen, Bissonette, et al., 1977Andersen, Bissonette, et al., 1977
Comment MSDC-RI MSDC-RI MSDC-RI MSDC-RI MSDC-RI
Column type CapillaryCapillaryCapillaryPacked
Active phase Apiezon LSF-96Apiezon LSE-30
Column length (m)
Carrier gas    He
Substrate    Chromosorb G
Column diameter (mm)
Phase thickness (μm)
Temperature (C) 190.170.155.130.
I 1562.1526.51547.1504.
ReferenceAndersen, Ohta, et al., 1977Andersen, Syrdal, et al., 1973Andersen, Syrdal, et al., 1973Andersen and Falcone, 1969
Comment MSDC-RI MSDC-RI MSDC-RI MSDC-RI

References

Pinheiro, de Queiros, et al., 2013
Pinheiro, P.F.; de Queiros, V.T.; Rondelli, V.M.; Costa, A.V.; MArcelino, T. deP.; Pratissoli, D., Insecticidal activity of citronells grass essential oil on Frankliniella schultzei and Myzus persicae, Cienc. Agrotec. Lavras, 2013, 37, 2, 138-144, https://doi.org/10.1590/S1413-70542013000200004 . [all data]

Rodriques, Amorim, et al., 2013
Rodriques, K.A. da.F.; Amorim, L.V.; de Oliveira, J.M.G.; Dias, C.N.; Moraes, D.F.C.; Andrade, E.H. deA.; Maia, J.G.S.; Carneiro, S.M.P.; Carvalho, F.A. deA., Eugenia uniflora L. essential oil as a potential anti-Leishmania agent: effect on Leishmania amazonensis and possible mechanism of action, Evidence-Based Complementary and Alternative Medicine, 2013, 2013, 1-10, https://doi.org/10.1155/2013/279726 . [all data]

Sardashti, Valizadeh, et al., 2013
Sardashti, A.R.; Valizadeh, J.; Adhami, Y., Variations in the essential oil composition of Peroskia abrotonolides of different growth stage in Baluchestan, Middle-East J. Sci. Res., 2013, 13, 6, 781-784. [all data]

Bendiabdellah, El Amine Dib, et al., 2012
Bendiabdellah, A.; El Amine Dib, M.; Djabou, N.; Allali, H.; Tabti, B.; Costa, J.; Myseli, A., Biological activities and volatile cinstituents of Daucus muricatus L. from Algeria, Chem. Centr. J., 2012, 6, 48, 1-22. [all data]

Boukhris, Bouaziz, et al., 2012
Boukhris, M.; Bouaziz, M.; Feki, I.; Jemai, H.; El Feki, A.; Sayadi, S., Hypoglycemic and antioxidant effects of leaf essential oil of Pelargonium graveolens L'Her. in alloxan induced diabetic rats, Lipids in Health and Disease, 2012, 11, 1, 1-10, https://doi.org/10.1186/1476-511X-11-81 . [all data]

Jian-Yu, Zhu, et al., 2012
Jian-Yu, S.; Zhu, L.; Tian, Y.-J., Chemical composition and antimicrobial activities of essential oil of Matricaria songarica, Int. J. Agriculture Biology, 2012, 14, 1, 107-110. [all data]

Phungpanya, Thongpoon, et al., 2012
Phungpanya, C.; Thongpoon, C.; Pripdeevech, P.; Machan, T., Analysis of aroma volatiles from fresh leaves of Plectranthus amboinicus using solid phase microextraction (SPME) technique, Pure and Applied Chemistry International Conference 2012 (PACCON 2012), 2012, 16701672. [all data]

Velickovic, Ristic, et al., 2012
Velickovic, D.T.; Ristic, M.S.; Karabegovic, I.T.; Stojicevic, S.S.; Lazic, M.L., The influence of the distillation method on the chemical composition of the essential oil of sage (Salvia officinalis L.), Advanced Technologies, 2012, 1, 1, 47-51. [all data]

Xu, Han, et al., 2012
Xu, L.-L.; Han, T.; Wu, J.-Z.; Zhang, Q.-Y.; Zhang, H.; Huang, B.-K.; Rahman, K., Comparative research of chemical constituents, antifungal and antitumor properties of ether extracts of Panax ginseng and its endophytic fungus, 2012, retrieved from http://www.thefreelibrary.com/Comparative .... [all data]

Yapi, Boti, et al., 2012
Yapi, T.A.; Boti, J.B.; Attioua, B.K.; Ahibo, A.C.; Bighelli, A.; Casanova, J.; Tomi, F., Three new natural compounds from the root bark essential oil from Xylopia aethiopica, Phytochem. Anal., 2012, 1-6. [all data]

Zouari, Ayadi, et al., 2012
Zouari, N.; Ayadi, I.; Fakhfakh, N.; Rebai, A.; Zouari, S., Variations of chemical composition of essential oils in wild-populations of Thymus algeriensis Boiss et Reut., a North African endemic species, Lipids in Health and Desease, 2012, 11, 1, 28-39, https://doi.org/10.1186/1476-511X-11-28 . [all data]

Bertoli, Lepnardi, et al., 2011
Bertoli, A.; Lepnardi, M.; Krzyzanowska, J.; Oleszek, W.; Pistelli, L., Mentha longifolia in vitro cultures as safe source of flavouring ingradients, Acta Biochem. Polonica, 2011, 58, 4, 581-587. [all data]

Feizbakhsh and Naeemy, 2011
Feizbakhsh, A.; Naeemy, A., Volatile constituents of essential oils of Eleocharis pauciflora (Light) Link and Eleocharis uniglumis (Link) J.A. Schultes growing wild in Iran, Bull. Chem. Soc. Ethiop., 2011, 25, 3, 461-464, https://doi.org/10.4314/bcse.v25i3.68606 . [all data]

Kahriman, Tosun, et al., 2011
Kahriman, N.; Tosun, G.; Terzioglu, S.; Karaoglu, S.A.; Yayh, N., Chemical composition and antimicrobial activity of the essential oils from the flower, leaf, and stem of Senecio pandurifolis, Rec. Nat. Prod., 2011, 5, 2, 82-91. [all data]

Karimi, Farmani, et al., 2011
Karimi, H.; Farmani, A.; Nourizadeh, H., A performance comparison of modern statistical technique for molecular descriptor selection and retention prediction of essential oil from leaves, Amer. J. Sci. Res., 2011, 38, 36-40. [all data]

Leffingwell and Alford, 2011
Leffingwell, J.; Alford, E.D., Volatile constituents of the giant pufball mushroom (Calvatia gigantea), Leffingwell Rep., 2011, 4, 1-17. [all data]

Menichini, Tundis, et al., 2011
Menichini, F.; Tundis, R.; Bonesi, M.; de Cindio, B.; Loizzo, M.R.; Conforti, F.; Statti, G.A.; Menabeni, R.; Bettini, R.; Menichini, F., Chemical composition and bioactivity of Citrus medica L. cv. Diamante essential oil obtained by hydrodistillation, cold-pressing and supercritical carbon dioxide extraction, Nat. Prod. Res., 2011, 25, 8, 789-799, https://doi.org/10.1080/14786410902900085 . [all data]

Mothana, Hasson, et al., 2011
Mothana, R.A.A.; Hasson, S.S.; Schultze, W.; Mowitz, A.; Lindequist, U., Phytochemical composition and in vitro antimicrobial and antioxidant activities of essential oils of three endemic Soqotraen Boswellia species, Food Chem., 2011, 126, 3, 1149-1154, https://doi.org/10.1016/j.foodchem.2010.11.150 . [all data]

Osorio, Carriazo, et al., 2011
Osorio, C.; Carriazo, J.G.; Barbosa, H., Thermal and structural study of Guava (Psidium guajava L.) powders obtained by two dehydration methods, Quim. Nova, 2011, 34, 4, 636-640, https://doi.org/10.1590/S0100-40422011000400016 . [all data]

Prasad, Moulekhi, et al., 2011
Prasad, K.; Moulekhi, K.; Bisht, G., Chemical composition of the essential oil of Pavetta indica L. leaves, Res. J. Phytochem., 2011, 5, 1, 66-69, https://doi.org/10.3923/rjphyto.2011.66.69 . [all data]

Vazques, Aimar, et al., 2011
Vazques, A.M.; Aimar, M.L.; Demmel, G.I.; Criado, S.G.; Ruiz, G.M.; Cantero, J.J.; Rossi, L.I.; Velasco, M.I., Determination of volatile organic compounds of Tagetes argentina Cabrera (asteraceae) using HS-SPME analysis, Boletin Latinoamericano y del Caribe Plantas Medicinales y Aromaticas, 2011, 10, 5, 463-469. [all data]

Vazquez, Demmel, et al., 2011
Vazquez, A.M.; Demmel, G.I.; Criado, S.G.; Aimar, M.L.; Cantero, J.; Rossi, L.I.; Velasco, M.I., Phytochemistry of TAgetes minuta L. (Asteraceae) from Cordoba, Argentina: comparative study between essential oil and HS-SPME analyses, Boletin Latinoamericano y del Caribe Plantas Medicinales y Aromaticas, 2011, 10, 4, 351-362. [all data]

Zarai, Kadri, et al., 2011
Zarai, Z.; Kadri, A.; Ben Chobba, I.; Ben Mansour, R.; Bekir, R.; Mejdoub, H.; Gharsallah, N., The in-vitro evaluation of antibacterial, antifungal and cytotoxic properties of Marrubium vulgare L. essential oil grown in Tunisia, Lipids in Health and Disease, 2011, 10, 161, 1-8. [all data]

Baharum, Bunawan, et al., 2010
Baharum, S.N.; Bunawan, H.; Ghani, M.A.; Mustafa, W.A.W.; Noor, N.M., Analysis of the chemical composition of the essential oil of Polygonum minus Huds. using two-dimensional gas chromatography - time of flight mass spectrometry (GC-TOF-MS), Molecules, 2010, 15, 10, 7006-7015, https://doi.org/10.3390/molecules15107006 . [all data]

Bi Kouame, Bedi, et al., 2010
Bi Kouame, F.P.; Bedi, G.; Koffi, A.M.; Chalchat, J.C.; Guessan, T.Y.N., Volatile constituents from leaves of Morinda morindoides (Rubiaceae): a medicinal plant from the Ivory Coast, The Open Nat. Prod. J., 2010, 3, 1, 6-9, https://doi.org/10.2174/1874848101003010006 . [all data]

Boix, Victorio, et al., 2010
Boix, V.F.; Victorio, C.P.; Lage, C.L.S.; Kuster, R.M., Volatile compounds from Rosmarinus officinalis L. and Baccharis dracunculifolia DC. growing in Southeast coast of Brasil, Quim. Nova, 2010, 33, 2, 255-257, https://doi.org/10.1590/S0100-40422010000200004 . [all data]

Cavar, Maksimovic, et al., 2010
Cavar, S.; Maksimovic, M.; Solic, M.E., Comparison of essential oil composition of Stachys menthufolia Vis. from two natural habitas in Croatia, Biologica Nyssana, 2010, 1, 1-2, 99-103. [all data]

Dib, Djabou, et al., 2010
Dib, M.ElA.; Djabou, N.; Desjobert, L.-M.; Allali, H.; Tabti, B.; Muselli, A.; Costa, J., Characterization of volatile compounds of Daucus crinitus Desf. headspace solid phase microextraction as alternative technique to hydrodistillation, Chem, Centr. J., 2010, 4, 16, 1-15. [all data]

Ho, Wang, et al., 2010
Ho, C.-L.; Wang, E.I.-C.; Yu, H.-T.; Yu, H.-M.; Su, Y.-C., Composition amd antioxidant activities of essential oils of different tissues from Cryptomeria japonica D. Don, Quarterly J. Chin. Forestry, 2010, 32, 1, 63-76. [all data]

Lazarevic, Palic, et al., 2010
Lazarevic, J.S.; Palic, R.V.M.; Radulovic, N.S.; Ristic, N.R.; Stojanovic, G.S., Chemical composition and screening of the antimicrobial and antioxidative acrivity of extracts of Stachys species, J. Serb. Chem. Soc., 2010, 75, 10, 1347-1359, https://doi.org/10.2298/JSC100601117L . [all data]

Mishra, Chaudhary, et al., 2010
Mishra, R.K.; Chaudhary, S.; Pandey, R.; Gupta, S.; Mallavarapu, G.R.; Kumar, S., Analysis of linalool content in the inflorescence (flower) essential oil and leaf oil of Lippia alba cultivar Kavach, J. Essen. Oil Res., 2010, 22, 1, 3-7, https://doi.org/10.1080/10412905.2010.9700253 . [all data]

Miyazawa, Kawauchi, et al., 2010
Miyazawa, M.; Kawauchi, Y.; Utsumi, Y.; Takahashi, T., Character impact odorants of wild edible plant - Cacalia hastata L. var. orientalis - used in Japanese traditional food, J. Oleo Sci., 2010, 59, 10, 527-533, https://doi.org/10.5650/jos.59.527 . [all data]

Monsef-Esfahani, Miri, et al., 2010
Monsef-Esfahani, H.R.; Miri, A.; Amini, M.; Amanzadeh, Y.; Hadjiakhoondi, A.; Hajiaghaee, R.; Ajani, Y., Seasonal variations in the chemical composition, antioxidant activity and total phenolic content of Teucrium persicum Boiss. essential oils, Res. J. Biol. Sci., 2010, 5, 7, 492-498, https://doi.org/10.3923/rjbsci.2010.492.498 . [all data]

Ogunwande, Flamini, et al., 2010
Ogunwande, I.A.; Flamini, G.; Cioni, P.L.; Omikorede, O.; Azeez, R.A.; Ayodele, A.A.; Kamil, Y.O., Aromatic plants growing in Nigeria: essential oil constituents of Cassia alata (Linn.) Roxb. and Helianthus annuus L., Rec. Nat. Prod., 2010, 4, 4, 211-217. [all data]

Radulovic, Blagojevic, et al., 2010
Radulovic, N.; Blagojevic, P.; Palic, R., Comparative study of the leaf volatiles of Arctostaphylos uva-ursi (L.) Spreng. and Vaccinium vitis-idaea L. (Ericaceae), Molecules, 2010, 15, 9, 6168-6185, https://doi.org/10.3390/molecules15096168 . [all data]

Radulovic, Dordevic, et al., 2010
Radulovic, N.S.; Dordevic, N.D.; Palic, R.M., Volatiles of Pleurospermum austriacum (L.) Hoffm. (Apiaceae), J. Serbian Chem. Soc., 2010, 75, 12, 1-11, https://doi.org/10.2298/JSC100323127R . [all data]

Radulovic, Dordevic, et al., 2010, 2
Radulovic, N.; Dordevic, N.; Markovic, M.; Palic, R., Volatile constituents of Glechoma Hirsuta Waldst. Kit. and G. Hederacea L. (Lamiaceae), Bull. Chem. Soc. Ethiop., 2010, 24, 1, 67-76, https://doi.org/10.4314/bcse.v24i1.52962 . [all data]

Safaei-Ghomi and Batooli, 2010
Safaei-Ghomi, J.; Batooli, H., Determination of bioactive molecules from flowers, leaves, stems and roots of Perovskia abrotanoides Karel growing in central Iran by nano scale injection, Digest J. Nanomaterials Biostructures, 2010, 5, 2, 551-556. [all data]

Scandinaro, Tranchida, et al., 2010
Scandinaro, M.; Tranchida, P.Q.; Costa, R.; Dugo, P.; Mondello, L., Rapid Quality Control of Flavours and Fragrances using Fast GC-MS and Multi-MS Library Search Procedures, LCGC Europe, 2010, 23, 9, 456-464. [all data]

Scherer, Wagner, et al., 2010
Scherer, R.; Wagner, R.; Meireles, M.A.A.; Godoy, H.T.; Duarte, M.C.T.; Filho, J.T., Biological activity and chemical composition of hydrodistilled and supercritical extracts of Xanthium strumarium L. leaves, J. Essen. Oil. Res., 2010, 22, 5, 424-429, https://doi.org/10.1080/10412905.2010.9700363 . [all data]

Silva, Pott, et al., 2010
Silva, D.B.; Pott, A.; Oliveira, D.C.R., Analyses of the headspace volatile constituents of aerial parts (leaves and stems), flowers and fruits of Bidens gardneri Bak. and Bidens sulphurea (Cav.) Sch. Bip. using solid-phase microextraction, J. Essen. Oil Res., 2010, 22, 6, 560-563, https://doi.org/10.1080/10412905.2010.9700400 . [all data]

de Souza, Lopes, et al., 2010
de Souza, A.; Lopes, E.M.C.; da Silva, M.C.; Cordeiro, I.; Young, M.C.M.; Sobral, M.E.G.; Moreno, P.R.H., Chemical composition and acetylcholinesterase inhibitory activity of essential oils of Myrceugenia myrciolides (Cambess.) O. Berg and Eugenia riedelliana O. Berg, Myrtaceae, Braz. J. Pharmacognosy, 2010, 20, 2, 175-179. [all data]

Takeoka, Hobbs, et al., 2010
Takeoka, G.R.; Hobbs, C.; Byeoung-Soo, P., Volatile constituents of the aerial parts of Salvia apiana Jepson, J. Essential Oil. Res., 2010, 22, 3, 241-244, https://doi.org/10.1080/10412905.2010.9700314 . [all data]

Vahirua-Lechat, Mitermite, et al., 2010
Vahirua-Lechat, I.; Mitermite, Y.; Menut, C., Aromatic plants of French Polynesia. IV. Composition and chemical variations of the essential oils of leaves of Etlingera cevuga (seeman) R.E. Smith, J. Essen. Oil Res., 2010, 22, 5, 407-409, https://doi.org/10.1080/10412905.2010.9700357 . [all data]

Xu, Tang, et al., 2010
Xu, X.; Tang, Z.; Liang, Y., Comparative analysis of plant essential oils by GC-MS coupled with integrated chemometric resolution methods, Anal. Methods, 2010, 2, 4, 359-367, https://doi.org/10.1039/b9ay00213h . [all data]

Dayisoylu and Alma, 2009
Dayisoylu, K.S.; Alma, M.H., Chemical analysis of essential oils from cone's rosin of Cilician fir (Abies cilicica subsp. cilicica), Afr. J. Biotechnol., 2009, 8, 15, 3502-3505. [all data]

Gilani, Shah, et al., 2009
Gilani, A.H.; Shah, A.J.; Zubair, A.; Khalid, S.; Kiani, J.; Ahmed, A.; Rasheed, M.; Ahmad, V.U., Chemical composition and mechanisms underlying the spasmolytic and bronchodilatory properties of the essential oil of Nepeta cataria L., J. Ethnopharmacology, 2009, 121, 3, 405-411, https://doi.org/10.1016/j.jep.2008.11.004 . [all data]

Ho, Wang, et al., 2009
Ho, C.-L.; Wang, E.I.-C.; Su, Y.-C., Essential oil compositions and bioactivities of the various parts of Cinnamomum camphora Sieb. var. linallolifera Fujuta, Journal title only in Chinese, 2009, 31, 2, 77-96. [all data]

Karlsson, Birgersson, et al., 2009
Karlsson, M.F.; Birgersson, G.; Prado, A.M.C.; Bosa, F.; Bengtsson, M.; Witzgall, P., Plant Odor Analysis of Potato: Responce of Guatemalan Moth to Above- and Background Potato Volatiles, J. Agric. Food Chem., 2009, 57, 13, 5903-5909, https://doi.org/10.1021/jf803730h . [all data]

Kim and Chung, 2009
Kim, J.-S.; Chung, H.Y., GC-MS analysis of the volatile components in dried boxthorn (Lycium chimensis) Fruit, J. Korean Soc. Appl. Biol. Chem., 2009, 52, 5, 516-524, https://doi.org/10.3839/jksabc.2009.088 . [all data]

Koba, Sanda, et al., 2009
Koba, K.; Sanda, K.; Guyon, C.; Raynaud, C.; Chaumont, J.-P.; Nicod, L., In vitro cytotoxic activity of Cymbopogon citratus L. and Cymbopogon nardus L. essential oils from Togo, J. Bangladesh Pharmacological Soc., 2009, 4, 29-34. [all data]

Marchesini, Prada, et al., 2009
Marchesini, A.M.; Prada, G.G.; Messiano, G.B.; Machado, M.B.; Lopes, L.M.X., Chemical constituents of Aristolochia giberti, J. Braz. Chem. Soc., 2009, 20, 9, 1598-1608, https://doi.org/10.1590/S0103-50532009000900006 . [all data]

Museli, Pau, et al., 2009
Museli, A.; Pau, M.; Desjobert, J.-M.; Foddai, M.; Usai, M.; Costa, J., Volatile constituents of Achllea ligustica All. by HS-SPME/GC/GC-MS. Comparison with essential oils obtained by hydrodistillation from Corsica and Sardinia, Chromatographia, 2009, 69, 5/6, 575-585, https://doi.org/10.1365/s10337-008-0939-1 . [all data]

Ottavioli, Bighelli, et al., 2009
Ottavioli, J.; Bighelli, A.; Casanova, J.; Bang, B.T.; Y., GC (retention indices), GC-MS, and 13C NMR of two citral-rich Cymbopogon leaf oils: C. Flexuosus and C. tortilis, Spectroscopy Lett., 2009, 42, 8, 506-512, https://doi.org/10.1080/00387010903022350 . [all data]

Porto, Decorti, et al., 2009
Porto, C.Da.; Decorti, D.; Kikic, I., Flavour compounds of Lavandula angustifolia L. to use in food manufacturing: comparison of three different extraction methods, Food Chem., 2009, 112, 4, 1072-1078, https://doi.org/10.1016/j.foodchem.2008.07.015 . [all data]

Retta, Gattuso, et al., 2009
Retta, D.; Gattuso, M.; Gattuso, S.; Lira, P. Di Leo; van Baren, C.; Ferraro, G.; Bandoni A., Essential oil composition of Achyrocline flaccida (Weinm.) DC. (Asteraceae) from different locations of Argentina, Biochem. Systematics Ecol., 2009, 36, 12, 877-881, https://doi.org/10.1016/j.bse.2008.11.001 . [all data]

Scrivanti, Anton, et al., 2009
Scrivanti, L.R.; Anton, A.M.; Zygadlo, J.A., Essential oil conposition of Bothriochloa Kuntze (Poaceae) from South America and their chemotaxonomy, Biochem. Systematics Ecol., 2009, 37, 3, 206-213, https://doi.org/10.1016/j.bse.2009.03.009 . [all data]

Shimizu, Imayoshi, et al., 2009
Shimizu, Y.; Imayoshi, Y.; Kato, M.; Maeda, K.; Iwabuchi, H.; Shimomura, K., Volatiles from leaves of field-grown plants and shoot cultures of Gynura bicolor DC, Flavour Fragr. J., 2009, 24, 5, 251-258, https://doi.org/10.1002/ffj.1938 . [all data]

de Souza, Lopes, et al., 2009
de Souza, A.; Lopes, E.M.C.; da Silva, M.C.; Cordeiro, I.; Young, M.C.M.; Sobral, M.E.G.; Moreno, P.R.H., Chemical composition and acetylcholinesterase inhibitory activity of essential oils of Myrceugenia myrcioides (Chambess.) O. Berg and Eugenia riedeliana O. Berg, Myrtaceae, Braz. J. Pharmacognosy, 2009, 20, 2, 175-179. [all data]

Su, Wang, et al., 2009
Su, Y.; Wang, C.; Yinlong, G., Analysis of volatile compounds from Mentha hapioealyx Briq. by GC-MS based on accurate mass measurements and retention indices, Acta Chem. Sinica, 2009, 67, 6, 546-554. [all data]

Xu, Han, et al., 2009
Xu, L.-L.; Han, T.; Wu, J.-Z.; Zhang, Q.-Y.; Zhang, H.; Huang, B.-K.; Rahman, K., Comparative research of chemical constituents, antifungal and antitumor properties of ether extracts of Panax ginseng and its endophytic fungus, Phytomedicine: Int. J. Phytotherapy Phytopharmacology, 2009, 16, 6-7, 609-616, https://doi.org/10.1016/j.phymed.2009.03.014 . [all data]

Zhao, Zeng, et al., 2009
Zhao, C.; Zeng, Y.; Wan, M.; Li, R.; Liang, Y.; Li, C.; Zeng, Z.; Chau, F.-T., Comparative analysis of essential oils from eight herbal medicines with pungent flavor and cool nature by GC-MS and chemometric resolution methods, J. Sep. Sci., 2009, 32, 4, 660-670, https://doi.org/10.1002/jssc.200800484 . [all data]

Aicha, Ines, et al., 2008
Aicha, N.; Ines, S.; Mohamed, B.S.; Ines, B.; Soumaya, K.; Kamel, G.; Mohamed, N.; Imed, C.; Mohamed, H.; Leila, C.-G., Chemical composition, mutagenic and antimutagenic activities of essential oils from (Tunisian) Artemisia campestris and Artemisia herba-alba, J. Ess. Oil Res., 2008, 20, 5, 471-477. [all data]

Baziou, Couladis, et al., 2008
Baziou, P.; Couladis, M.; Petrakis, P.V.; Verykokidou, E.; Harvala, C., Composition and antioxidant activity of the essential oil of Hypericum perfoliatum from Greece, 2008, retrieved from http://www.amapseec.org/cmapseec.1/Papers/papp065.htm. [all data]

Chieng, Assim, et al., 2008
Chieng, T.C.; Assim, Z.B.; Fasihuddin, B.A., Toxicity and antitermite activities of the essential oils from Piper sarmentosum, The Malaysian J. Anal. Sci., 2008, 12, 1, 234-239. [all data]

Djarri, Medjroubi, et al., 2008
Djarri, L.; Medjroubi, K.; Akkai, S.; Elomri, A.; Seguin, E.; Groult, M.-L.; Verite, P., Variability of two essential olis of Kundmannia sicula (L.) DC., a traditional Algerian medicinal plant, Molecules, 2008, 13, 4, 812-817, https://doi.org/10.3390/molecules13040812 . [all data]

Forero, Quijano, et al., 2008
Forero, M.D.; Quijano, C.E.; Pino, J.A., Volatile compounds of Chile pepper (Capsicum annuum L. var. glabriusculum) at two ripening stages, Flavour Fragr. J., 2008, 24, 1, 25-30, https://doi.org/10.1002/ffj.1913 . [all data]

Isidorov, Lech, et al., 2008
Isidorov, V.A.; Lech, P.; Zolciak, A.; Rusak, N.; Szczepaniak, L., Gas Chromatographic - nass spectrometric investigation of metabolites from the needles and roots of pine seedlings at early stages of pathogenic fungi Armillaria ostoyae attack, Trees, 2008, 22, 4, 531-542, https://doi.org/10.1007/s00468-008-0213-z . [all data]

Kowalski, 2008
Kowalski, R., Antimicrobial activity of essential oils and extracts of rosinweed (Silphoum trifoliatum and Silphium integrifolium) plants used by the American Indians, Flav. Fragr. J., 2008, 23, 6, 426-433, https://doi.org/10.1002/ffj.1901 . [all data]

Lo Presti, Sciarrone, et al., 2008
Lo Presti, M.; Sciarrone, D.; Crupi, M.C.; Costa, R.; Ragusa, S.; Dugo, G.; Mondello, L., Evaliation of the volatile and chiral composition in Pistacia lentiscus L. essential oil, Flavour Fragr. J., 2008, 23, 4, 249-257, https://doi.org/10.1002/ffj.1878 . [all data]

Mosayebi, Amin, et al., 2008
Mosayebi, M.; Amin, G.; Arzani, H.; Azarnivand, H.; Maleki, M.; Shafaghat, A., Effect of habitat on essential oil of Achillea filipendula L. in Iran, Asian J. Plant Sci., 2008, 7, 8, 779-781, https://doi.org/10.3923/ajps.2008.779.781 . [all data]

Noudogbessi, Yedomonhan, et al., 2008
Noudogbessi, J.-P.; Yedomonhan, P.; Sohounhloue, D.C.K.; Chalchat, J.-C.; Figueredo, G., Chemical composition of essential oil of syzygium guineense (Willd.) DC. var. guineense (Myrtaceae) from Benin, Rec. Nat. Prod., 2008, 33-38. [all data]

Paolini, Tomi, et al., 2008
Paolini, J.; Tomi, P.; Bernardini, A.-F.; Bradesi, P.; Casanova, J.; Kaloustian, J., Detailed analysis of the essential oil from Cistus albidus L. by combination of GC/RI, GC/MS and 13C-NMR spectroscopy, N.Z. J. Agric. Res., 2008, 22, 14, 1270-1278. [all data]

Raj, Baby, et al., 2008
Raj, G.; Baby, S.; Dan, M.; Thaha, A.R.M.; Sethuraman, M.G.; George, V., Volatile constituents from the rhisomes of Curcuma haritha Mangaly and Sabu from Sauthern India, Flavour Fragr. J., 2008, 23, 5, 348-352, https://doi.org/10.1002/ffj.1891 . [all data]

Risticevic, Carasek, et al., 2008
Risticevic, S.; Carasek, E.; Pawliszyn, J., Headspace solid-phase microextraction-gas chromatographic-time-of-flight mass spectrometric methodology for geographical origin verification of coffee, Anal. Chim. Acta, 2008, 617, 1-2, 72-84, https://doi.org/10.1016/j.aca.2008.04.009 . [all data]

Sarikurkcu, Tepe, et al., 2008
Sarikurkcu, C.; Tepe, B.; Daferera, D.; Polissiou, M.; Harmandar, M., Studies on the anioxidant activity of the essential oil and methanol extract of Marrubium globosum subsp. globosum (lamiaceae) by three different chemical assays, Bioresource Technol., 2008, 99, 10, 4239-4246, https://doi.org/10.1016/j.biortech.2007.08.058 . [all data]

Shellie, 2008
Shellie, R.A., Comprehensive 2D GC-QPMS with differential flow modulation, LV-GC, 2008, 11, 7-18. [all data]

Skalicka-Wozniak, Los, et al., 2008
Skalicka-Wozniak, K.; Los, R.; Glowniak, K.; Malm, A., Variation of the volatile content of the fruits of Peucedanum alsaticum L., Acta Chromatographica, 2008, 20, 1, 119-133, https://doi.org/10.1556/AChrom.20.2008.1.10 . [all data]

Yassa and Akhani, 2008
Yassa, N.; Akhani, H., The essential oils composition in two species of the genus Eriocycla Lindl. (Apiaceae) from Iran, 2008, retrieved from http://biology.ut.ac.ir/members/akhani/PdfReprintNumber/27.pdf. [all data]

Adams, Beauchamp, et al., 2007
Adams, R.P.; Beauchamp, P.S.; Dev, V.; Dutz, S.M., New Natural Products Isolated from One-Seeded Juniperus of the Southwestern United States: Isolation and Occurence of 2-Ethenyl-3-methyl Phanol and Its Derivatives, J. Essent. Oil Res., 2007, 19, 2, 146-152, https://doi.org/10.1080/10412905.2007.9699247 . [all data]

Amiri, 2007
Amiri, H., Quantative and qualative changes of essential oil of Salvia bracteata BAnk et Sol. in different growth stages, DARU, 2007, 15, 2, 79-82. [all data]

Andrade, Oliveira, et al., 2007
Andrade, E.H.A.; Oliveira, J.; Zoghbi, M.G.B., Volatiles of Anaxagorea dolichocarpa Spreng. Sandw. and Annona densicoma Mart. Growing Wild in the State of Pará, Brazil, Flavour Fragr. J., 2007, 22, 2, 158-160, https://doi.org/10.1002/ffj.1776 . [all data]

Argyropoulou, Daferera, et al., 2007
Argyropoulou, C.; Daferera, D.; Tarantilis, P.A.; Fasseas, C.; Polissiou, M., Chemical composition of the essential oil from leaves of Lippia citriodora H.B.K. (Verbenaceae) at two developmental stages, Biochem. Syst. Ecol., 2007, 35, 12, 831-837, https://doi.org/10.1016/j.bse.2007.07.001 . [all data]

Baran, von Reuss, et al., 2007
Baran, S.; von Reuss, S.H.; König, W.A.; Kalemba, D., Composition of the essential oil of Abies koreana Wils., Flavour Fragr. J., 2007, 22, 1, 78-83, https://doi.org/10.1002/ffj.1762 . [all data]

Bos, Woerdenbag, et al., 2007
Bos, R.; Woerdenbag, H.J.; Kayser, O.; Quax, W.J.; Ruslan, K.; Elfami, Essential oil constituents of Piper cubeba L. fils. from Indonesia, J. Essent. Oil Res., 2007, 19, 1, 14-17, https://doi.org/10.1080/10412905.2007.9699217 . [all data]

Capetanos, Saroglou, et al., 2007
Capetanos, C.; Saroglou, V.; Marin, P.D.; Simic, A.; Skaltsa, H.D., Essential oil snalysis of two endemic Eringium species from Serbia, J. Serb. Chem. Soc., 2007, 72, 10, 961-965, https://doi.org/10.2298/JSC0710961C . [all data]

Cheraif, Ben Jannet, et al., 2007
Cheraif, I.; Ben Jannet, H.; Hammami, M.; Khouja, M.L.; Mighri, Z., Chemical composition and antimicrobial activity of essential oils of Cupressus arizonica Greene, Biochem. Syst. Ecol., 2007, 35, 12, 813-820, https://doi.org/10.1016/j.bse.2007.05.009 . [all data]

Da Silva J.K.R., Sousa P.J.C., et al., 2007
Da Silva J.K.R.; Sousa P.J.C.; Andrade E.H.A.; Maia JGS, Antioxidant capacity and cytotoxicity of essential oil and methanol extract of Aniba canellia (HBK) Mez, J. Agric. Food Chem., 2007, 55, 23, 9422-9426, https://doi.org/10.1021/jf071928e . [all data]

Edris, Chizzola, et al., 2007
Edris, A.E.; Chizzola, R.; Franz, C., Isolation and characterization of the volatile aroma compounds from the concrete headspace and the absolute of Jasminum sambac (L.) Ait. (Oleaceae) flowers grown in Egypt, Eur. Food Res. Technol., 2007, https://doi.org/10.1007/s00217-007-0623-y . [all data]

Elfami, Bos, et al., 2007
Elfami; Bos, R.; Ruslan, K.; Woerdenbag, H.J.; Kayser, P.; Quax, W.J., Essential Oil Constituents of Piper cubeba from Indonesia, 2007, 53-60. [all data]

Farsam, Amanlou, et al., 2007
Farsam, H.; Amanlou, M.; Taghi-Cheetsaz, N.; Amin, G.R.; Saledi-Sormaghi, M.H., Essential Oil of Chimonanthus fragrans flowers Population of Tehran, DARU, 2007, 15, 3, 129-131. [all data]

Ferhat, Meklati, et al., 2007
Ferhat, M.A.; Meklati, B.Y.; Chemat, F., Comparison of different isolation methods of essential oil from Citrus fruits: cold pressing, hydrodistillation and microwave dry distillation, Flavour Fragr. J., 2007, 22, 6, 494-504, https://doi.org/10.1002/ffj.1829 . [all data]

Ferhat, Tigrine-Kordjani, et al., 2007
Ferhat, M.A.; Tigrine-Kordjani, N.; Chemat, S.; Meklati, B.Y.; Chemat, F., Rapid Extraction of Volatile Compounds Using a New Simultaneous Microwave Distillation: Solvent Extraction Device, Chromatographia, 2007, 65, 3-4, 217-222, https://doi.org/10.1365/s10337-006-0130-5 . [all data]

Ghasempour, Shirinpour, et al., 2007
Ghasempour, H.R.; Shirinpour, E.; Heidari, H., The constituents of essential oils of Ferulago angulata (Schlecht.) Boiss at two different habitats, Nevakoh and Shahoo, Agross mountain, Western Iran, Iranian J. Sci. Technol., 2007, 31, A3, 309-312. [all data]

Gudaityte and Venskutonis R.P., 2007
Gudaityte, O.; Venskutonis R.P., Chemotypes of Achillea millefolium transferred from 14 different locations in Lithuania to the controlled environment, Biochem. Syst. Ecol., 2007, 35, 9, 582-592, https://doi.org/10.1016/j.bse.2007.03.016 . [all data]

Hachicha, Skanji, et al., 2007
Hachicha, S.F.; Skanji, T.; Barrek, S.; Ghrabi, Z.G.; Zarrouk, H., Composition of the essential oil of Teucrium ramosissimum Desf. (Lamiaceae) from Tunisia, Flavour Fragr. J., 2007, 22, 2, 101-104, https://doi.org/10.1002/ffj.1764 . [all data]

Hudaib and Aburjai, 2007
Hudaib, M.; Aburjai, T., Volatile components of Thymus vulgaris L. from wild-growing and cultivated plants in Jordan, Flavour Fragr. J., 2007, 22, 4, 322-327, https://doi.org/10.1002/ffj.1800 . [all data]

Jerkovic, Mastelic, et al., 2007
Jerkovic, I.; Mastelic, J.; Marijanovic, Z., Bound volatile compounds and essential oil from the fruit of Maclura pomifera (Raf.) Schneid. (osage orange), Flavour Fragr. J., 2007, 22, 1, 84-88, https://doi.org/10.1002/ffj.1763 . [all data]

Kiran, Devi, et al., 2007
Kiran, S.R.; Devi, P.S.; Reddy, K.J., Bioactivity of essential oils and sesquiterpenes of Chloroxylon swietenia DC against Helicoverpa armigera, Current Science, 2007, 93, 4, 544-548. [all data]

Limberger, Scopel, et al., 2007
Limberger, R.P.; Scopel, M.; Sobral, M.; Henriques, A.T., Comparative analysis of volatiles from Drimys brasiliensis Miers and D. angustifolia Miers (Winteraceae) from Southern Brazil, Biochem. Syst. Ecol., 2007, 35, 3, 130-137, https://doi.org/10.1016/j.bse.2006.09.007 . [all data]

Loizzo, Tundis, et al., 2007
Loizzo, M.R.; Tundis, R.; Conforti, F.; Saab, A.M.; Statti, G.A.; Menichini, F., Comparative chemical composition, antioxidant and hypoglycaemic activities of Juniperus oxycedrus ssp. oxycedrus L. berry and wood oils from Lebanon, Food Chem., 2007, 105, 2, 572-578, https://doi.org/10.1016/j.foodchem.2007.04.015 . [all data]

Marongiu B., Piras A., et al., 2007
Marongiu B.; Piras A.; Porcedda S.; Tuveri E.; Sanjust E.; Meli M.; Sollai F.; Zucca P.; Rescigno A., Supercritical CO2 extract of Cinnamomum zeylanicum: Chemical characterization and antityrosinase activity, J. Agric. Food Chem., 2007, 55, 24, 10022-10027, https://doi.org/10.1021/jf071938f . [all data]

Meccia, Rojas, et al., 2007
Meccia, G.; Rojas, L.B.; Velasco, J.; Diaz, T.; Usubillaga, A., Composition and antibacterial screening of the essential oils of leaves and roots of Espeletiopsis angustifolia Cuetrec, Natural Product Communications, 2007, 2, 12, 1221-1224. [all data]

Miyazawa and Tamura, 2007
Miyazawa, M.; Tamura, N., Components of the essential oil from sprouts of Polygonum hydropiper L. ('Benitade'), Flavour Fragr. J., 2007, 22, 3, 188-190, https://doi.org/10.1002/ffj.1779 . [all data]

Mohottalage, Tabacchi, et al., 2007
Mohottalage, S.; Tabacchi, R.; Guerin, P.M., Components from Sri Lankan Piper betle L. leaf oil and their analogues showing toxicity against the housefly, Musca domestica, Flavour Fragr. J., 2007, 22, 2, 130-138, https://doi.org/10.1002/ffj.1770 . [all data]

Monser-Esfahani, Karamkhani, et al., 2007
Monser-Esfahani, H.R.; Karamkhani, F.; Nickavar, B.; Abdi, K.; Faramarzi, M.A., The Volatile Constituents of Dracocephalum kotschyi Oils, Chem. Nat. Comp., 2007, 43, 1, 40-43, https://doi.org/10.1007/s10600-007-0027-z . [all data]

Moreno, Lima, et al., 2007
Moreno, P.R.H.; Lima, M.E.L.; Sobral, M.; Young, M.C.M.; Cordeiro, I.; Apel, M.A.A.; Limberger, R.P.; Henriques, A.T., Essential oil composition of fruit colour varieties of Eugenia brasiliensis Lam., Sci. Agr.; (Piracicaba Praz.), 2007, 64, 4, 428-432. [all data]

Morteza-Semnani, Saeedi, et al., 2007
Morteza-Semnani, K.; Saeedi, M.; Akbarzadeh, M., Essential oil composition of Teucrium scordium L., Acta Pharm., 2007, 57, 4, 499-504, https://doi.org/10.2478/v10007-007-0040-6 . [all data]

Nori-Shargh, Raftari, et al., 2007
Nori-Shargh, D.; Raftari, S.; Deyhimi, F., Analysis of the essential oil of Grammosciadium scabridum Boiss. from Iran, Flavour Fragr. J., 2007, 22, 5, 350-351, https://doi.org/10.1002/ffj.1803 . [all data]

Oliveira, Leitão, et al., 2007
Oliveira, D.R.; Leitão, G.G.; Bizzo, H.R.; Lopes, D.; Alviano, D.S.; Alviano, C.S.; Leitão, S.G., Chemical and antimicrobial analyses of essential oil of Lippia origanoides H.B.K, Food Chem., 2007, 101, 1, 236-240, https://doi.org/10.1016/j.foodchem.2006.01.022 . [all data]

Phutdhawong, Kawaree, et al., 2007
Phutdhawong, W.; Kawaree, R.; Sanjaia, S.; Sengpracha, W.; Buddhasukh, D., Microwave-Assisted Isolation of Essential Oil of Cinnamomum iners Reinw. es Bl.: Comparison with Conventional Hydrodistillation, Molecules, 2007, 12, 4, 868-877, https://doi.org/10.3390/12040868 . [all data]

Pinto, Salgueiro, et al., 2007
Pinto, E.; Salgueiro, L.R.; Cavaleiro, C.; Palmeira, A.; Goncalves, M.J., In vitro susceptibility of some species of yeasts and filamentous fungi to essential oils of Salvia of?cinalis, Ind. Crops Prod., 2007, 26, 2, 135-141, https://doi.org/10.1016/j.indcrop.2007.02.004 . [all data]

Pontes, de Olivera, et al., 2007
Pontes, W.J.T.; de Olivera, J.C.G.; da Camara, C.A.G.; Lopes, A.C.H.R.; Gondim Jr.; de Olivera, J.V.; Barros, R.; Schwartz, M.O.E., Chemical composition and acaridical activity of the leaf and fruit essential oils of Protium heptaphyllum (Aubl.) Marchand (Burseraceae), Acta Amazonica, 2007, 37, 1, 103-110, https://doi.org/10.1590/S0044-59672007000100012 . [all data]

Raal, Orav, et al., 2007
Raal, A.; Orav, A.; Arak, E.; Kailas, T.; Müürisepp, M., Variation in the composition of the essential oil of Valeriana officinalis L. roots from Estonia, Proc. Est. Acad. Sci. Chem., 2007, 56, 2, 67-74. [all data]

Rali, Wossa, et al., 2007
Rali, T.; Wossa, S.W.; Leach, D.N., Comparative Chemical Analysis of the Essential Oil Constituents in the Bark, Heartwood and Fruits of Cryptocarya massoy (Oken) Kosterm. (Lauraceae) from Papua New Guinea, Molecules, 2007, 12, 149-154. [all data]

Rali, Wossa, et al., 2007, 2
Rali, T.; Wossa, S.W.; Leach, D.N.; Waterman, P.G., Volatile chemical constituents of Piper aduncum L and Piper gibbilimbum C. DC (Piperaceae) from Papua New Guinea, Molecules, 2007, 12, 3, 389-394, https://doi.org/10.3390/12030389 . [all data]

Reza, Ebrahim, et al., 2007
Reza, G.H.; Ebrahim, S.; Hossein, H., Analysis by gas chromatography - mass spectrometry of essential oil from seeds and aerial parts of Ferulago angulata (Schlecht.) Boiss gatheres in Nevakoh and Shahoo, Zagross mountain, west of Iran, Pakistan J. Biol. Sci., 2007, 10, 5, 814-817, https://doi.org/10.3923/pjbs.2007.814.817 . [all data]

Rojas, Velasco, et al., 2007
Rojas, J.; Velasco, J.; Rojas, L.B.; Carmona, J.; Morales, A., Chemical composition and antimicrobial activity of the essential oil of Baacharis latifolia Pers. and B. prunifolia H.B.K. (Asteraceae), Natural Product Communications, 2007, 2, 12, 1245-1248. [all data]

Safaei-Ghomi, Bamoniri, et al., 2007
Safaei-Ghomi, J.; Bamoniri, A.; Hatami, A.; Batooli, H., Composition of the Essential Oil of Stachys acerosa Growing in Central Iran, Chem. Nat. Comp., 2007, 43, 1, 37-39, https://doi.org/10.1007/s10600-007-0026-0 . [all data]

Sefidkon, Abbasi, et al., 2007
Sefidkon, F.; Abbasi, K.; Jamzad, Z.; Ahmadi, S., The effect of distillation methods and stage of plant growth on the essential oil content and composition of Satureja rechingeri Jamzad, Food Chem., 2007, 100, 3, 1054-1058, https://doi.org/10.1016/j.foodchem.2005.11.016 . [all data]

Smelcerovic, Spiteller, et al., 2007
Smelcerovic, A.; Spiteller, M.; Ligon, A.P.; Smelcerovic, Z.; Raabe, N., Essential oil composition of Hypericum L. species from Southeastern Serbia and their chemotaxonomy, Biochem. Syst. Ecol., 2007, 35, 2, 99-113, https://doi.org/10.1016/j.bse.2006.09.012 . [all data]

Sylvestre, Longtin, et al., 2007
Sylvestre, M.; Longtin, A.P.A.; Legault, J., Volatile leaf condtituents and anticancer activity of Bursera simaruba (L.) Sarg. essential oil, Natural Product Communications, 2007, 2, 12, 1273-1276. [all data]

Tava, Pecetti, et al., 2007
Tava, A.; Pecetti, L.; Ricci, M.; Pagnotta, M.A.; Russi, L., Volatile compounds from leaves and flowers of Bituminaria bituminosa (L.) Stirt. (Fabaceae) from Italy, Flavour Fragr. J., 2007, 22, 5, 363-370, https://doi.org/10.1002/ffj.1806 . [all data]

Tzakou, Bazos, et al., 2007
Tzakou, O.; Bazos, I.; Yannitsaros, A., Volatile metabolites of Pistacia atlantica Desf. from Greece, Flavour Fragr. J., 2007, 22, 5, 358-362, https://doi.org/10.1002/ffj.1805 . [all data]

Vagionas, Graikou, et al., 2007
Vagionas, K.; Graikou, K.; Ngassapa, O.; Runyoro, D.; Chinou, I., Composition and antimicrobial activity of the essential oils of three Satureja species growing in Tansania, Food Chem., 2007, 103, 2, 319-324, https://doi.org/10.1016/j.foodchem.2006.07.051 . [all data]

Vichi, Riu-Aumatell, et al., 2007
Vichi, S.; Riu-Aumatell, M.; Mora-Pons, M.; Guadayol, J.M.; Buxaderas, S.; López-Tamames, E., Analytical, Nutritional and Clinical Methods. HS-SPME coupled to GC/MS for quality control of Juniperus communis L. berries used for gin aromatization, Food Chem., 2007, 105, 4, 1748-1754, https://doi.org/10.1016/j.foodchem.2007.03.026 . [all data]

Wenguang, Wenlai, et al., 2007
Wenguang, J.; Wenlai, F.; Yan, X.; Guangao, Z.; Jiming, L.; Ying, Y., Analysis of free terpenoids in four Vitis vinifera varietis using solvent assisted flavour evaporation and gas chromatography-tandem mass spectrometry, Chinese J. Chromatogr., 2007, 25, 6, 881-886, https://doi.org/10.1016/S1872-2059(08)60006-1 . [all data]

Yassa and Akhani, 2007
Yassa, N.; Akhani, H., The essential oils composition in two species of the genus Eriocycla Lindl. (Apiaceae) from Iran, 2007, retrieved from http://biology.ut.ac.ir/members/akhani/PdfReprintNumber/27.pdf. [all data]

Zizovic, Stamenic, et al., 2007
Zizovic, I.; Stamenic, M.; Ivanovic, J.; Orlovic, A.; Ristic, M.; Djordjevic, S.; Petrovic, S.D.; Skala, D., Supercritical carbon dioxide extraction of sesquiterpenes from valerian root, J. Supercrit. Fluids, 2007, 43, 2, 249-258, https://doi.org/10.1016/j.supflu.2007.05.007 . [all data]

Apel, Sobral, et al., 2006
Apel, M.A.; Sobral, M.; Zuanazzi, J.A.S.; Henriques, A.T., Essential oil composition of four Plinia species (Myrtaceae), Flavour Fragr. J., 2006, 21, 3, 565-567, https://doi.org/10.1002/ffj.1638 . [all data]

Apel, Sobral, et al., 2006, 2
Apel, M.A.; Sobral, M.; Zuanazzi, J.A.S.; Henriques, A.T., Essential oil composition of Calycorectes australis and Calycorectes psidiiflorus (Myrtaceae), Flavour Fragr. J., 2006, 21, 4, 656-658, https://doi.org/10.1002/ffj.1640 . [all data]

Ayoub, Al-Azizi, et al., 2006
Ayoub, N.; Al-Azizi, M.; König, W.; Kubeczka, K.-H., Essential oils and a novel polyacetylene from Eryngium yuccifolium Michaux. (Apiaceae), Flavour Fragr. J., 2006, 21, 6, 864-868, https://doi.org/10.1002/ffj.1631 . [all data]

Bertrand, Comte, et al., 2006
Bertrand, C.; Comte, G.; Piola, F., Solid-phase microextraction of volatile compounds from flowers of two Brunfelsia species, Biochem. Syst. Ecol., 2006, 34, 5, 371-375, https://doi.org/10.1016/j.bse.2005.12.005 . [all data]

Biondi, Sari, et al., 2006
Biondi, D.M.; Sari, M.i.; Ghani, Z.A.l.; Ruberto, G., Essential oil of Algerian Saccocalyx satureioides Coss. et Durieu, Flavour Fragr. J., 2006, 21, 3, 546-548, https://doi.org/10.1002/ffj.1661 . [all data]

Borges, Rojas, et al., 2006
Borges, R.; Rojas, L.B.; Cegarra, J.A.; Usubillaga, A., Study of the essential oils from the leaves and flowers of Lepechinia conferta (Benth) Epl., Flavour Fragr. J., 2006, 21, 1, 155-157, https://doi.org/10.1002/ffj.1550 . [all data]

Boti, Muselli, et al., 2006
Boti, J.B.; Muselli, A.; Tomi, F.; Koukoua, G.; N'Guessan, T.Y.; Costa, J.; Casanova, J., Combined analysis of Cymbopogon giganteus Chiov. leaf oil from Ivory Coast by GC/RI, GC/MS and 13C-NMR, C.R. Chim., 2006, 9, 1, 164-168, https://doi.org/10.1016/j.crci.2005.10.003 . [all data]

Boti, Yao, et al., 2006
Boti, J.B.; Yao, P.A.; Koukoua, G.; N'Guessan, T.Y.; Casanova, J., Components and chemical variability of Isolona campanulata Engler Diels leaf oil, Flavour Fragr. J., 2006, 21, 1, 166-170, https://doi.org/10.1002/ffj.1555 . [all data]

Bozin, Mimicá-Dukic, et al., 2006
Bozin, B.; Mimicá-Dukic, N.; Simin, N.; Anackov, G., Characterization of the volatile composition of essential oils of some lamiaceae spices and the antimicrobial and antioxidant activities of the entire oils, J. Agric. Food Chem., 2006, 54, 5, 1822-1828, https://doi.org/10.1021/jf051922u . [all data]

Castel, Fernandez, et al., 2006
Castel, C.; Fernandez, X.; Lizzani-Cuvelier, L.; Loiseau, A.-M.; Perichet, C.; Delbecque, C.; Arnaudo, J.-F., Volatile constituents of benzoin gums: Siam and Sumatra, part 2. Study of headspace sampling methods, Flavour Fragr. J., 2006, 21, 1, 59-67, https://doi.org/10.1002/ffj.1502 . [all data]

Castel, Fernandez, et al., 2006, 2
Castel, C.; Fernandez, X.; Lizzani-Cuvelier, L.; Perichet, C.; Lavoine, S., Characterization of the Chemical Composition of a Byproduct from Siam Benzoin Gum, J. Agric. Food Chem., 2006, 54, 23, 8848-8854, https://doi.org/10.1021/jf061193y . [all data]

Cavaleiro, Pinto, et al., 2006
Cavaleiro, C.; Pinto, E.; Gonsales, M.J.; Salguero, L., Antifungal activity of Juniperus essential oils agains dermatophyte, Asrgillus and Candida strains, J. Appl. Microbiol., 2006, 100, 6, 1333-1338, https://doi.org/10.1111/j.1365-2672.2006.02862.x . [all data]

Chen, Sheu, et al., 2006
Chen, H.-C.; Sheu, M.-J.; Wu, C.-M., Characterization of Volatiles in Guava (Psidium guajava L. cv. Chung-Shan-Yueh-Pa) Fruit from Taiwan, J. Food Drug. Anal., 2006, 14, 4, 398-402. [all data]

Damjanovic, Skala, et al., 2006
Damjanovic, B.; Skala, D.; Baras, J.; Petrovic-Djakov, D., Isolation of essential oil and supercritical carbon dioxide extract of Juniperus communis L. fruits from Montenegro, Flavour Fragr. J., 2006, 21, 6, 875-880, https://doi.org/10.1002/ffj.1711 . [all data]

Ebrahim Sajjadi and Mehregan, 2006
Ebrahim Sajjadi, S.; Mehregan, I., Volatile constituents of flowers and leaves of Anthemis hyalina, Chem. Nat. Compd. (Engl. Transl.), 2006, 42, 5, 531-533, https://doi.org/10.1007/s10600-006-0207-2 . [all data]

Elfami, Komar, et al., 2006
Elfami, R.B.; Komar, R.; Woerdenbag, H.J.; Kayser, P.; Quax, W.J., Essential oil constituents of Piper cubeba from Indonesia, 2006, retrieved from http://dissertations.ub.rug.nl/FILES/facultiew/science/2006/elfahmi/05c5.pdf. [all data]

Fernandez, Pintaric, et al., 2006
Fernandez, X.; Pintaric, C.; Lizzani-Cuvelier, L.; Loiseau, A.-M.; Morello, A.; Pellerin, P., Chemical composition of absolute and supercritical carbon dioxide extract of Aframomum melegueta, Flavour Fragr. J., 2006, 21, 1, 162-165, https://doi.org/10.1002/ffj.1554 . [all data]

Figuérédo, Cabassu, et al., 2006
Figuérédo, G.; Cabassu, P.; Chalchat, J.-C.; Pasquier, B., Studies of Mediterranean oregano populations. VIII. Chemical composition of essential oils of oreganos of various origins, Flavour Fragr. J., 2006, 21, 1, 134-139, https://doi.org/10.1002/ffj.1543 . [all data]

Filippi, Lanfranchi, et al., 2006
Filippi, J.-J.; Lanfranchi, D.-A.; Prado, S.; Baldovini, N.; Meierhenrich, U.J., Composition, Enantiomeric Distribution, and Antibacterial Activity of the Essential Oil of Achillea ligustica All. from Corsica, J. Agric. Food Chem., 2006, 54, 17, 6308-6313, https://doi.org/10.1021/jf060752y . [all data]

Garneau F.X., Collin G., et al., 2006
Garneau F.X.; Collin G.; Gagnon H.; Jean F.I.; Strobl H.; Pichette A., The essential oil composition of Devil's Club, Oplopanax horridus J. E. Smith Miq., Flavour Fragr. J., 2006, 21, 5, 792-794, https://doi.org/10.1002/ffj.1716 . [all data]

Gohari, Hadjiakhoondi, et al., 2006
Gohari, A.R.; Hadjiakhoondi, A.; Sadat-Ebrahimi, E.; Saeidnia, S.; Shafiee, A., Composition of the volatile oils of Satureja spicigera C. Koch Boiss. and S. macrantha C. A. Mey from Iran, Flavour Fragr. J., 2006, 21, 2, 348-350, https://doi.org/10.1002/ffj.1642 . [all data]

Gohari A.R., Hadjiakhoondi A., et al., 2006
Gohari A.R.; Hadjiakhoondi A.; Sadat-Ebrahimi E.; Saeidnia S.; Shafiee A., Composition of the volatile oils of Satureja spicigera C. Koch Boiss. and S-macrantha C. A. Mey from Iran, Flavour Fragr. J., 2006, 21, 3, 510-512, https://doi.org/10.1002/ffj.1613 . [all data]

Ibañez and Usubillaga, 2006
Ibañez, J.; Usubillaga, A., The essential oil of Espeletia schultzii of different altitudinal populations, Flavour Fragr. J., 2006, 21, 2, 286-289, https://doi.org/10.1002/ffj.1586 . [all data]

Javidnia, Miri, et al., 2006
Javidnia, K.; Miri, R.; Kamalinejad, M.; Mehdipour, A.R., Composition of the essential oil of Diplotaenia cachrydifolia Boiss. from Iran, J. Ess. Oil Res., 2006, 18, 1, 86-87, https://doi.org/10.1080/10412905.2006.9699393 . [all data]

Kiran, Bhavani, et al., 2006
Kiran, S.R.; Bhavani, K.; Devi, P.S.; Rao, B.R.R.; Reddy, K.J., Composition and alrvicidal activity of leaves and stem essential oils of Chloroxylon swietenia DC against Aedes aegypti and Anopheles stephensi, Biores. Technol., 2006, 97, 18, 2481-2484, https://doi.org/10.1016/j.biortech.2005.10.003 . [all data]

Kucuk, Gulec, et al., 2006
Kucuk, M.; Gulec, C.; Yasar, A.; Ucuncu, O.; Yayh, N.; Coskuncelebi, K.; Terzioglu, S.; Yayh, N., Chemical composition and antimicrobial activities of the essential oils of Teucrium chamaedrys subsp. chamaedrys, T. orientale var. puberulens, and T. chamaedrys subsp. lydium, Pharm. Biol., 2006, 44, 8, 592-599, https://doi.org/10.1080/13880200600896868 . [all data]

Lan Phi N.T., Nishiyama C., et al., 2006
Lan Phi N.T.; Nishiyama C.; Choi H.-S.; Sawamura M., Evaluation of aroma characteristic compounds of Citrus natsudaidai Hayata (Natsudaidai) cold-pressed peel oil, Biosci. Biotechnol. Biochem., 2006, 70, 8, 1832-1838, https://doi.org/10.1271/bbb.50705 . [all data]

Lesueur, Ban, et al., 2006
Lesueur, D.; Ban, N.K.; Bighelli, A.; Muselli, A.; Casanova, J., Analysis of the root oil of Fokienia hodginsii (Dunn) Henry et Thomas (Cupressaceae) by GC, GC-MS and 13C-NMR, Flavour Fragr. J., 2006, 21, 1, 171-174, https://doi.org/10.1002/ffj.1557 . [all data]

Lis and Milczarek, 2006
Lis, A.; Milczarek, J., Chemical composition of the essential oils from fruits, leaves and flowers of Phellodendron sachalinense (Fr. Schmidt) Sarg., Flavour Fragr. J., 2006, 21, 4, 683-686, https://doi.org/10.1002/ffj.1662 . [all data]

Martin, Joseph, et al., 2006
Martin, M.A.C.K.; Joseph, H.; Bercion, S.; Menut, C., Chemical composition of essential oils from aerial parts of Aframomum exscapum (Sims) Hepper collected in Guadeloupe, French West Indies, Flavour Fragr. J., 2006, 21, 6, 902-905, https://doi.org/10.1002/ffj.1741 . [all data]

Marzouk, Mansour, et al., 2006
Marzouk, Z.; Mansour, H.B.; Chraief, I.; Mosrati, R.; Cheriaa, J.; Neffati, A.; Marzouk, B.; Sfari, M.; Boukef, K.; Barillies, D.; Ghedira, L.C., Chemical composition, antibacterial and antimutagenic activities of four populations of Rosmarinus officinalis L. oils from Tunisia, J. Food Agriculture Environment, 2006, 4, 2, 89-94. [all data]

Marzouk, Neffati, et al., 2006
Marzouk, Z.; Neffati, A.; Marzouk, B.; Chraief, I.; Fathia, K.; Ghedira, L.C.; Boukef, K., Chemical composition and antibacterial and antimutagenic activity of Tunisian Rosmarinus officinalis L. oil from Kasrine, Journal of Food, Agriculture Environment, 2006, 4, 34, 61-65. [all data]

Mirza, Navaei, et al., 2006
Mirza, M.; Navaei, M.N.; Dini, M., Volatile constituents of essential oils isolated from flowers and leaves of Eupatorium cannabinum L. from Iran, Iranian J. Pharmaceutical Res., 2006, 2, 149-152. [all data]

Moody, Gundidza, et al., 2006
Moody, J.O.; Gundidza, M.; Wyllie, G., Essential oil composition of Leucas milanjiana Guerke, Flavour Fragr. J., 2006, 21, 6, 872-874, https://doi.org/10.1002/ffj.1669 . [all data]

Morteza-Semnani, Akbarzadeh, et al., 2006
Morteza-Semnani, K.; Akbarzadeh, M.; Changizi, S., Essential oils composition of Stachys byzantina, S. inflata, S. lavandulifolia and S. laxa from Iran, Flavour Fragr. J., 2006, 21, 2, 300-303, https://doi.org/10.1002/ffj.1594 . [all data]

Morteza-Semnani K., Akbarzadeh M., et al., 2006
Morteza-Semnani K.; Akbarzadeh M.; Moshiri K., The essential oil composition of Eupatorium cannabinum L. from Iran, Flavour Fragr. J., 2006, 21, 3, 521-523, https://doi.org/10.1002/ffj.1687 . [all data]

Morteza-Semnani K., Saeedi M., et al., 2006
Morteza-Semnani K.; Saeedi M.; Changizi S., The essential oil composition of Hypericum scabrum L. from Iran, Flavour Fragr. J., 2006, 21, 3, 513-515, https://doi.org/10.1002/ffj.1614 . [all data]

Olawore, Usman, et al., 2006
Olawore, N.O.; Usman, L.A.; Ogunwande, I.A.; Adeleke, K.A., Constituents of rhizome essential oils of two types of Cyperus articulatus L. grown in Nigeria, J. Essent Oil Res., 2006, 18, 6, 604-606, https://doi.org/10.1080/10412905.2006.9699179 . [all data]

Orav, Raal, et al., 2006
Orav, A.; Raal, A.; Arak, E.; Müürisepp, M.; Kailas, T., Composition of the essential oil of Artemisia absinthium L. of different geographical origin, Proc. Est. Acad. Sci. Chem., 2006, 55, 3, 155-165. [all data]

Ouamba, Ouabonzi, et al., 2006
Ouamba, J.-M.; Ouabonzi, A.; Ekouya, A.; Bessière, J.-M.; Menut, C.; Abena, A.A.; Banzouzi, J.-T., Volatile constituents of the essential oil leaf of Lantana salvifolia Jacq. (Verbenaceae), Flavour Fragr. J., 2006, 21, 1, 158-161, https://doi.org/10.1002/ffj.1553 . [all data]

Pala-Paul J., Perez-Alonso M.J., et al., 2006
Pala-Paul J.; Perez-Alonso M.J.; Velasco-Negueruela A.; Ballesteros M.T.; Sanz J., Essential oil composition of Sideritis hirsuta L. from Guadalajara Province, Spain, Flavour Fragr. J., 2006, 21, 3, 410-415, https://doi.org/10.1002/ffj.1727 . [all data]

Petrovic, Ristic, et al., 2006
Petrovic, S.; Ristic, M.; Milenkovic, M.; Kukic, J.; Antic-Stankovic, J.; Niketic, M., Composition and antimicrobial activity of essential oil of Stachys plumosa Griseb., Flavour Fragr. J., 2006, 21, 2, 250-252, https://doi.org/10.1002/ffj.1570 . [all data]

Pintore G., Chessa M., et al., 2006
Pintore G.; Chessa M.; Manconi P.; Zanetti S.; Deriu A.; Tirillini B., Chemical composition and antimicrobial activities of essential oil of stachys glutinosa L. from Sardinia, Natural Product Communications, 2006, 1, 12, 1133-1136. [all data]

Pino, Marbot, et al., 2006
Pino, J.A.; Marbot, R.; Payo, A.; Chao, D.; Herrera, P., Aromatic Plants from Western Cuba VII. Composition of the Leaf Oil of Psidium wrightii KRug et Urb., Lantana involucrata L., Cinnamonum montanum (Sw.) Berchtold et J. Persl. and Caesalpinia violacea (Mill.) Standley, J. Essent. Oil. Res., 2006, 18, 2, 170-174, https://doi.org/10.1080/10412905.2006.9699058 . [all data]

Pino, Sauri-Duch, et al., 2006
Pino, J.; Sauri-Duch, E.; Marbot, R., Changes in volatile compounds of Habanero chile pepper (Capsicum chinense Jack. cv. Habanero) at two ripening stages, Food Chem., 2006, 94, 3, 394-398, https://doi.org/10.1016/j.foodchem.2004.11.040 . [all data]

Potzernheim, Bizzo, et al., 2006
Potzernheim, M.C.L.; Bizzo, H.R.; Vieira, R.F., Analysis of the essential oil of three species of Piper collected in the region of the Distrito Federal (Cerrado - Brazilian Savannah) and comparison with oils of plants from region of Paraty, State of Rio de Janeiro (Atlantic Rain Forest), Brazilian Journal of Pharmacognosy, 2006, 16, 2, 246-251. [all data]

Pripdeevech, Wongpornchai, et al., 2006
Pripdeevech, P.; Wongpornchai, S.; Promsiri, A., Highly Volatile Constituents of Vetiveria zizanioides Roots Grown under Different Cultivation Conditions, Molecules, 2006, 11, 10, 817-826, https://doi.org/10.3390/11100817 . [all data]

Robinson, 2006
Robinson, C.J., A new essential oil - Agonis fragrans, A report for the Rural Industries Research and Development Corporation, RIRDC Publication No. 06/090, Rural Industries Research and Development Corporation, Barton, ACT, 2006, 12. [all data]

Rout, Naik, et al., 2006
Rout, P.K.; Naik, S.N.; Rao, Y.R., Composition of the concrete, absolute, headspace and essential oil of the flowers of Michelia champaca Linn., Flavour Fragr. J., 2006, 21, 6, 906-911, https://doi.org/10.1002/ffj.1742 . [all data]

Sabulal, Dan, et al., 2006
Sabulal, B.; Dan, M.; Anil, J.J.; Kurup, R.; Pradeep, N.S.; Valsamma, R.K.; George, V., Caryophyllene-rich rhizome oil of Zingiber nimmonii from South India: Chemical characterization and antimicrobial activity, Phytochemistry, 2006, 67, 22, 2469-2473, https://doi.org/10.1016/j.phytochem.2006.08.003 . [all data]

Sari M., Biondi D.M., et al., 2006
Sari M.; Biondi D.M.; Kaabeche M.; Mandalari G.; D'Arrigo M.; Bisignano G.; Saija A.; Daquino C.; Ruberto G., Chemical composition, antimicrobial and antioxidant activities of the essential oil of several populations of Algerian Origanum glandulosum Desf., Flavour Fragr. J., 2006, 21, 6, 890-898, https://doi.org/10.1002/ffj.1738 . [all data]

Shafi, Jose, et al., 2006
Shafi, P.M.; Jose, B.; Radhamani, K.T.; Clery, R.A., Influence of pH on essential oil composition of Zanthoxylum rhetsa seeds obtained by steam distillation, Flavour Fragr. J., 2006, 21, 2, 317-318, https://doi.org/10.1002/ffj.1598 . [all data]

Sonboli, Mirjalili, et al., 2006
Sonboli, A.; Mirjalili, M.H.; Yousefzadi, M., Antimicrobial activity and composition of the essential oil of Cymbopogon Olivieri (Boiss.) Bor from Iran, Iranian J. Pharm. Res., 2006, 1, 65-68. [all data]

Tesso, König, et al., 2006
Tesso, H.; König, W.A.; Son, P.T.; Giang, P.M., Composition of the essential oil of flowers of Chloranthus spicatus (Thunb.) Makino, Flavour Fragr. J., 2006, 21, 4, 592-597, https://doi.org/10.1002/ffj.1528 . [all data]

Tesso, Kubeczka, et al., 2006
Tesso, H.; Kubeczka, K.-H.; König, W.A., A new phthalide from the essential oil of Meum athamanticum, Flavour Fragr. J., 2006, 21, 4, 622-625, https://doi.org/10.1002/ffj.1629 . [all data]

Tornambe, Cornu, et al., 2006
Tornambe, G.; Cornu, A.; Pradel, P.; Kondjoyan, N.; Carnat, A.P.; Petit, M.; Martin, B., Changes in Terpene Content in Milk from Pasture-Fed Cows, J. Dairy Sci., 2006, 89, 6, 2309-2319, https://doi.org/10.3168/jds.S0022-0302(06)72302-5 . [all data]

Trilles, Bombarda, et al., 2006
Trilles, B.L.; Bombarda, I.; Bouraïma-Madjebi, S.; Raharivelomanana, P.; Bianchini, J.-P.; Gaydou, E.M., Occurrence of various chemotypes in niaouli [Melaleuca quinquenervia (Cav.) S. T. Blake] essential oil from New Caledonia, Flavour Fragr. J., 2006, 21, 4, 677-682, https://doi.org/10.1002/ffj.1649 . [all data]

Velasco-Negueruela, Pérez-Alonso, et al., 2006
Velasco-Negueruela, A.; Pérez-Alonso, M.J.; Pérez de Paz, P.L.; Palá-Paúl, J.; Sanz, J., Analysis by gas chromatography?mass spectrometry of the volatiles from the fruits of Ammodaucus leucotrichus subsp. leucotrichus and subsp. nanocarpus grown in North Africa and the Canary Islands, respectively, J. Chromatogr. A, 2006, 1108, 2, 273-275, https://doi.org/10.1016/j.chroma.2006.01.031 . [all data]

Wang, Kong, et al., 2006
Wang, P.; Kong, C.H.; Zhang, C.X., Chemical Composition and Antimicrobial Activity of the Essential Oil from Ambrosia trifida L., Molecules, 2006, 11, 7, 549-555, https://doi.org/10.3390/11070549 . [all data]

Wang, Yang, et al., 2006
Wang, Q.; Yang, Y.; Zhao, X.; Zhu, B.; Nan, P.; Zhao, J.; Wang, L.; Chen, F.; Liu, Z.; Zhong, Y., Chemical variation in the essential oil of Ephedra sinica from Northeastern China, Food Chem., 2006, 98, 1, 52-58, https://doi.org/10.1016/j.foodchem.2005.04.033 . [all data]

Wong, Lim, et al., 2006
Wong, K.C.; Lim, T.B.; Ali, D.M.H., Essential oil of Homalomena sagittifolia Jungh., Flavour Fragr. J., 2006, 21, 5, 786-788, https://doi.org/10.1002/ffj.1714 . [all data]

Asadipour, Mehrabani, et al., 2005
Asadipour, A.; Mehrabani, M.; Najafi, M.L., Volatile oil composition of Centaurea aucheri (DC.) wagenitz, DARU, 2005, 13, 3, 160-164. [all data]

Askari and Sefidkon, 2005
Askari, F.; Sefidkon, F., Volatile components of Pimpinella tragium Vill. from Iran, Iran. J. Pharm. Res., 2005, 2, 117-120. [all data]

Bendimerad and Bendiab, 2005
Bendimerad, N.; Bendiab, S.A.T., Composition and antibacterial activity of Pseudocytisus integrifolius (Salisb.) essential oil from Algeria, J. Agric. Food Chem., 2005, 53, 8, 2947-2952, https://doi.org/10.1021/jf047937u . [all data]

Busman, Zoghbi, et al., 2005
Busman, D.V.; Zoghbi, M.G.B.; Potiguara, R.C.V.; Andrade, E.H.A., Volatiles from different organs of Unxia camphorata L. f. growing wild in the Amazon, Biochem. Syst. Ecol., 2005, 33, 12, 1269-1273, https://doi.org/10.1016/j.bse.2005.07.001 . [all data]

Chagonda and Chalchat, 2005
Chagonda, L.S.; Chalchat, J.-C., The essential oil of wild and cultivated Hoslundia opposita Vahl. from Zimbabwe, Flavour Fragr. J., 2005, 20, 2, 193-195, https://doi.org/10.1002/ffj.1402 . [all data]

Chagonda and Chalchat, 2005, 2
Chagonda, L.S.; Chalchat, J.-C., The essential oil of the fruit of Garcinia huillensis Welw. ex. Oliv. from Zimbabwe, Flavour Fragr. J., 2005, 20, 3, 313-315, https://doi.org/10.1002/ffj.1420 . [all data]

Chaverri and Cicció, 2005
Chaverri, C.; Cicció, J.F., Essential oil of trees of the genus Ocotea (Lauraceae) in Costa Rica. I. Ocotea brenesii, Rev. Biol. Trop., 2005, 53, 3-4, 431-436, https://doi.org/10.15517/rbt.v53i3-4.14611 . [all data]

Chalchat and Özcan, 2005
Chalchat, J.-C.; Özcan, M., Constituents of the essential oil of Sideritis erythantha Boiss. Heldr. Var. erythrantha, Gen. Appl. Plant Physiology, 2005, 31, 1-2, 65-70. [all data]

Cornu, Kondjoyan, et al., 2005
Cornu, A.; Kondjoyan, N.; Martin, B.; Verdier-Metz, I.; Pradel, P.; Berdague, J.-L.; Coulon, J.-B., Terpene profiles in Cantal and Saint-Nectairetype cheese made from raw or pasteurised milk, J. Sci. Food Agric., 2005, 85, 12, 2040-2046, https://doi.org/10.1002/jsfa.2214 . [all data]

Dickschat, Martens, et al., 2005
Dickschat, J.S.; Martens, T.; Brinkhoff, T.; Simon, M.; Schulz, S., Volatiles released by a Streptomyces species isolated from the North Sea, Chemistry and Biodiversity, 2005, 2, 7, 837-865, https://doi.org/10.1002/cbdv.200590062 . [all data]

Dötterl, Wolfe, et al., 2005
Dötterl, S.; Wolfe, L.M.; Jürgens, A., Qualitative and quantitative analyses of flower scent in Silene latifolia, Phytochemistry, 2005, 66, 2, 203-213, https://doi.org/10.1016/j.phytochem.2004.12.002 . [all data]

Duarte, Figueira, et al., 2005
Duarte, M.C.T.; Figueira, G.M.; Sartoratto, A.; Rehder, V.L.G.; Delarmelina, C., Anti-Candida activity of Brazilian medicinal plants, J. Ethnopharmacol., 2005, 97, 2, 305-311, https://doi.org/10.1016/j.jep.2004.11.016 . [all data]

Facey, Porter, et al., 2005
Facey, P.C.; Porter, R.B.R.; Reese, P.B.; Williams, L.A.D., Biological activity and chemical composition of the essential oil from Jamaican Hyptis verticillata Jacq., J. Agric. Food Chem., 2005, 53, 12, 4774-4777, https://doi.org/10.1021/jf050008y . [all data]

Fakhari A.R., Sonboli A., et al., 2005
Fakhari A.R.; Sonboli A.; Heydari R., Composition of the essential oil of Rhabdosciadium strausii from Iran, Chem. Nat. Compd. (Engl. Transl.), 2005, 41, 4, 413-414, https://doi.org/10.1007/s10600-005-0164-1 . [all data]

Ferraz, Limberger, et al., 2005
Ferraz, A.B.F.; Limberger, R.P.; Bordignon, S.A.L.; von Poser, G.L.; Henriques, A.T., Essential oil composition of six Hypericum species from southern Brazil, Flavour Fragr. J., 2005, 20, 3, 335-339, https://doi.org/10.1002/ffj.1435 . [all data]

Fernandez, Lizzani-Cuvelier, et al., 2005
Fernandez, X.; Lizzani-Cuvelier, L.; Loiseau, A.-M.; Perichet, C.; Delbecque, C.; Arnaudo, J.-F., Chemical composition of the essential oils from Turkish and Honduras Styrax, Flavour Fragr. J., 2005, 20, 1, 70-73, https://doi.org/10.1002/ffj.1370 . [all data]

Figuérédo, Cabassu, et al., 2005
Figuérédo, G.; Cabassu, P.; Chalchat, J.-C.; Pasquier, B., Studies of Mediterranean oregano populations- V. Chemical composition of essential oils of oregano: Origanum syriacum L. var. bevanii (Holmes) Ietswaart, O. syriacum L. var. sinaicum (Boiss.) Ietswaart, and O. syriacum L. var. syriacum from Lebanon and Israel, Flavour Fragr. J., 2005, 20, 164-168. [all data]

Gauvin and Smadja, 2005
Gauvin, A.; Smadja, J., Essential oil composition of four Psiadia species from Reunion Island: A chemotaxonomic study, Biochem. Syst. Ecol., 2005, 33, 7, 705-714, https://doi.org/10.1016/j.bse.2004.12.013 . [all data]

Ghasemi Y., Faridi P., et al., 2005
Ghasemi Y.; Faridi P.; Mehregan I.; Mohagheghzadeh A., Ferula gummosa fruits: An aromatic antimicrobial agent, Chem. Nat. Compd. (Engl. Transl.), 2005, 41, 3, 311-314, https://doi.org/10.1007/s10600-005-0138-3 . [all data]

Jirovetz, Buchbauer, et al., 2005
Jirovetz, L.; Buchbauer, G.; Stoyanova, A.; Georgiev, E.V.; Damianova, S.T., Composition, quality control and antimicrobial activity of the essential oil of cumin (Cuminum cyminumL.) seeds from Bulgaria that had been stored for up to 36 years, Int. J. Food Sci. Technol., 2005, 40, 3, 305-310, https://doi.org/10.1111/j.1365-2621.2004.00915.x . [all data]

Jovanovic, Kitic, et al., 2005
Jovanovic, T.; Kitic, D.; Palic, R.; Stojanovic, G.; Ristic, M., Chemical composition and antimicrobial activity of the essential oil of Acinos arvensis (Lam.) Dandy from Serbia, Flavour Fragr. J., 2005, 20, 3, 288-290, https://doi.org/10.1002/ffj.1409 . [all data]

Khanavi, Ghasemian, et al., 2005
Khanavi, M.; Ghasemian, L.; Motlagh, E.H.; Hadjiakhoondi, A.; Shafiee, A., Chemical composition of the essential oils of Marrubium parviflorum Fisch. C.A. Mey. and Marrubium vulgare L. from Iran, Flavour Fragr. J., 2005, 20, 3, 324-326, https://doi.org/10.1002/ffj.1425 . [all data]

Khajeh, Yamini, et al., 2005
Khajeh, M.; Yamini, Y.; Bahramifar, N.; Sefidkon, F.; Reza Pirmoradei, M., Comparison of essential oils compositions of Ferula assa-foetida obtained by supercritical carbon dioxide extraction and hydrodistillation methods, Food Chem., 2005, 91, 4, 639-644, https://doi.org/10.1016/j.foodchem.2004.06.033 . [all data]

Kowalski and Wolski, 2005
Kowalski, R.; Wolski, T., The chemical composition of essential oils of Silphium perfoliatum L., Flavour Fragr. J., 2005, 20, 3, 306-310, https://doi.org/10.1002/ffj.1418 . [all data]

Kowalski, 2005
Kowalski, R., Analysis of lipophylic fraction from leaves, inflorescences and rhizomes of Siphium perfoliatum L., Acta Soc. Botanicorum Poloniae, 2005, 74, 1, 5-10, https://doi.org/10.5586/asbp.2005.001 . [all data]

Leffingwell and Alford, 2005
Leffingwell, J.C.; Alford, E.D., Volatile constituents of Perique tobacco, Electron. J. Environ. Agric. Food Chem., 2005, 4, 2, 899-915. [all data]

Limberger, Sobral, et al., 2005
Limberger, R.P.; Sobral, M.; Henriques, A.T., Intraspecific volatile oil variation in Myrceugenia cucullata (Myrtaceae), Biochem. Syst. Ecol., 2005, 33, 3, 287-293, https://doi.org/10.1016/j.bse.2004.10.002 . [all data]

Marongiu, Piras, et al., 2005
Marongiu, B.; Piras, A.; Porcedda, S.; Scorciapino, A., Chemical composition of the essential oil and supercritical CO2 extract of Commiphora myrrha (Nees) Engl. and of Acorus calamus L., J. Agric. Food Chem., 2005, 53, 20, 7939-7943, https://doi.org/10.1021/jf051100x . [all data]

Morteza-Semnani, Akbarzadeh, et al., 2005
Morteza-Semnani, K.; Akbarzadeh, M.; Rostami, B., The essential oil composition of Teucrium chamaedrys L. from Iran, Flavour Fragr. J., 2005, 20, 5, 544-546, https://doi.org/10.1002/ffj.1479 . [all data]

Morteza-Semnani and Saeedi, 2005
Morteza-Semnani, K.; Saeedi, M., The essential oil composition of Phlomis bruguieri Desf. from Iran, Flavour Fragr. J., 2005, 20, 3, 344-346, https://doi.org/10.1002/ffj.1459 . [all data]

Ogunwande, Olawore, et al., 2005
Ogunwande, I.A.; Olawore, N.O.; Adeleke, K.A.; Ekundayo, O., Volatile constituents from the leaves of Eucalyptus cloeziana F. Muell and E. propinqua Deane Maiden from Nigeria, Flavour Fragr. J., 2005, 20, 6, 637-639, https://doi.org/10.1002/ffj.1516 . [all data]

Olawore, Ogunwande, et al., 2005
Olawore, N.O.; Ogunwande, I.A.; Ekundayo, O.; Adeleke, K.A., Chemical composition of the leaf and fruit essential oils of Murraya paniculata (L.) Jack. (Syn. Murraya exotica Linn.), Flavour Fragr. J., 2005, 20, 1, 54-56, https://doi.org/10.1002/ffj.1365 . [all data]

Oyedeji, Yani, et al., 2005
Oyedeji, O.A.; Yani, V.V.; Afolayan, A.J., Chemical composition of the essential oil from Arctotis arctotoides (L.F.) O. Hoffm. (syn. Vendium arctotoides Less.), Flavour Fragr. J., 2005, 20, 2, 232-234, https://doi.org/10.1002/ffj.1437 . [all data]

Pala-Paul, Perez-Alonso, et al., 2005
Pala-Paul, J.; Perez-Alonso, M.J.; Velasco-Negueruela, A.; Vadare, J.; Villa, A.M.; Sanz, J.; Brophy, J.J., Essential oil composition of the different parts of Eryngium bourgatii Gouan from Spain, J. Chromatogr. A, 2005, 1074, 1-2, 235-239, https://doi.org/10.1016/j.chroma.2005.03.036 . [all data]

Pellati, Benvenuti, et al., 2005
Pellati, F.; Benvenuti, S.; Yoshizaki, F.; Bertelli, D.; Rossi, M.C., Headspace solid-phase microextraction-gas chromatography-mass spectrometry analysis of the volatile compounds of Evodia species fruits, J. Chromatogr. A, 2005, 1087, 1-2, 265-273, https://doi.org/10.1016/j.chroma.2005.01.060 . [all data]

Petrakis, Roussis, et al., 2005
Petrakis, P.V.; Roussis, V.; Papadimitriou, D.; Vagias, C.; Tsitsimpikou, C., The effect of terpenoid extracts from 15 pine species on the feeding behavioural sequence of the late instars of the pine processionary caterpillar Thaumetopoea pityocampa, Behav. Processes, 2005, 69, 3, 303-322, https://doi.org/10.1016/j.beproc.2004.12.008 . [all data]

Pino, Marbot, et al., 2005
Pino, J.A.; Marbot, R.; Rosado, A.; Vázquez, C., Volatile constituents of genipap (Genipa americana L.) fruit from Cuba, Flavour Fragr. J., 2005, 20, 6, 583-586, https://doi.org/10.1002/ffj.1491 . [all data]

Rohloff and Bones, 2005
Rohloff, J.; Bones, A.M., Volatile profiling of Arabidopsis thaliana - Putative olfactory compounds in plant communication, Phytochemistry, 2005, 66, 16, 1941-1955, https://doi.org/10.1016/j.phytochem.2005.06.021 . [all data]

Rout, Misra, et al., 2005
Rout, P.K.; Misra, R.; Sahoo, S.; Sree, A.; Rao, Y.R., Extraction of kewda (Pandanus fascicularis Lam.) flowers with hexane: composition of concrete, absolute and wax, Flavour Fragr. J., 2005, 20, 4, 442-444, https://doi.org/10.1002/ffj.1466 . [all data]

Saeidnia, Gohari, et al., 2005
Saeidnia, S.; Gohari, A.R.; Yassa, N.; Shafiee, A., Composition of the volatile oil of Achillea conferta DC. from Iran, DARU, 2005, 13, 1, 34-36. [all data]

Sajjadi S.E. and Eskandari B., 2005
Sajjadi S.E.; Eskandari B., Chemical constituents of the essential oil of Nepeta oxyodonta, Chem. Nat. Compd. (Engl. Transl.), 2005, 41, 2, 175-177, https://doi.org/10.1007/s10600-005-0106-y . [all data]

Sajjadi and Ghannadi, 2005
Sajjadi, S.-E.; Ghannadi, A., Essential oil of the Persian sage, Salvia rhytidea Benth., Acta Pharm. Sin., 2005, 55, 321-326. [all data]

Salehi, Sefidkon, et al., 2005
Salehi, P.; Sefidkon, F.; Bazzaz Tolami, L.; Sonboli, A., Essential oil composition of Salvia palaestina Benth. from Iran, Flavour Fragr. J., 2005, 20, 5, 525-527, https://doi.org/10.1002/ffj.1448 . [all data]

Sarkhail, Amin, et al., 2005
Sarkhail, P.; Amin, G.; Surmaghi, M.H.S.; Shafiee, A., Composition of the volatile oils of Phlomis lanceolata Boiss. Hohen., Phlomis anisodonta Boiss. and Phlomis bruguieri Desf. from Iran, Flavour Fragr. J., 2005, 20, 3, 327-329, https://doi.org/10.1002/ffj.1427 . [all data]

Sefidkon and Jamzad, 2005
Sefidkon, F.; Jamzad, Z., Chemical composition of the essential oil of three Iranian Satureja species (S. mutica, S. macrantha and S. intermedia), Food Chem., 2005, 91, 1, 1-4, https://doi.org/10.1016/j.foodchem.2004.01.027 . [all data]

Senatore, Apostolides Arnold, et al., 2005
Senatore, F.; Apostolides Arnold, N.; Bruno, M., Volatile components of Centaurea eryngioides Lam. and Centaurea liberica Trev. var. hermonis Boiss. Lam., two Asteraceae growing wild in Lebanon, Nat. Prod. Res., 2005, 19, 8, 749-754, https://doi.org/10.1080/14786410412331302136 . [all data]

Setzer, Noletto, et al., 2005
Setzer, W.N.; Noletto, J.A.; Lawton, R.O.; Haber, W.A., Leaf essential oil composition of five Zanthoxylum species from Monteverde, Costa Rica, Molecular Diversity, 2005, 9, 1-3, 3-13, https://doi.org/10.1007/s11030-005-1298-6 . [all data]

Simoes-Pires C.A., Debenedetti S., et al., 2005
Simoes-Pires C.A.; Debenedetti S.; Spegazzini E.; Mentz L.A.; Matzenbacher N.I.; Limberger R.P.; Henriques A.T., Investigation of the essential oil from eight species of Baccharis belonging to sect. Caulopterae (Asteraceae, Astereae): a taxonomic approach, Plant Systematics and Evolution, 2005, 253, 1-4, 23-32, https://doi.org/10.1007/s00606-005-0296-6 . [all data]

Singh, Raina, et al., 2005
Singh, A.K.; Raina, V.K.; Naqvi, A.A.; Patra, N.K.; Kumar, B.; Ram, P.; Khanuja, S.P.S., Essential oil composition and chemoarrays of menthol mint (Mentha arvensis L. f. piperascens Malinvaud ex. Holmes) cultivars, Flavour Fragr. J., 2005, 20, 3, 302-305, https://doi.org/10.1002/ffj.1417 . [all data]

Slavkovska, Couladis, et al., 2005
Slavkovska, V.; Couladis, M.; Bojovic, S.; Tzakou, O.; Pavlovic, M.; Lakusic, B.; Jancic, R., Essential oil and its systematic significance in species of Micromeria Bentham from Serbia Montenegro, Plant Systematics and Evolution, 2005, 255, 1-2, 1-15, https://doi.org/10.1007/s00606-005-0303-y . [all data]

Sonboli A., Fakhari A.R., et al., 2005
Sonboli A.; Fakhari A.R.; Sefidkon F., Chemical composition of the essential oil of Salvia macilenta from Iran, Chem. Nat. Compd. (Engl. Transl.), 2005, 41, 2, 168-170, https://doi.org/10.1007/s10600-005-0104-0 . [all data]

Sonboli, Salehi, et al., 2005
Sonboli, A.; Salehi, P.; Ebrahimi, S.N., Essential oil composition and antibacterial activity of the leaves of Stachys schtschegleevii from Iran, Chem. Nat. Compd. (Engl. Transl.), 2005, 41, 2, 171-175, https://doi.org/10.1007/s10600-005-0105-z . [all data]

Sonboli, Salehi, et al., 2005, 2
Sonboli, A.; Salehi, P.; Allahyari, L., Essential oil composition of Nepeta involucrata from Iran, Chem. Nat. Compd. (Engl. Transl.), 2005, 41, 6, 683-685, https://doi.org/10.1007/s10600-006-0011-z . [all data]

Srivastava, Srivastava, et al., 2005
Srivastava, A.K.; Srivastava, S.K.; Syamsundar, K.V., Bud and leaf essential oil composition of Syzygium aromaticum from India and Madagascar, Flavour Fragr. J., 2005, 20, 1, 51-53, https://doi.org/10.1002/ffj.1364 . [all data]

Stevanovic, Garneau, et al., 2005
Stevanovic, T.; Garneau, F.-X.; Jean, F.-I.; Gagnon, H.; Vilotic, D.; Petrovic, S.; Ruzic, N.; Pichette, A., The essential oil composition of Pinus mugo Turra from Serbia, Flavour Fragr. J., 2005, 20, 1, 96-97, https://doi.org/10.1002/ffj.1390 . [all data]

Suárez, Vásquez, et al., 2005
Suárez, A.I.; Vásquez, L.J.; Manzano, M.A.; Compagnone, R.S., Essential oil composition of Croton cuneatus and Croton malambo growing in Venezuela, Flavour Fragr. J., 2005, 20, 6, 611-614, https://doi.org/10.1002/ffj.1498 . [all data]

Szafranek, Chrapkowska, et al., 2005
Szafranek, B.; Chrapkowska, K.; Pawinska, M.; Szafranek, J., Analysis of leaf surface sesquiterpenes in potato varieties, J. Agric. Food Chem., 2005, 53, 8, 2817-2822, https://doi.org/10.1021/jf040437g . [all data]

Topçu, Barla, et al., 2005
Topçu, G.; Barla, A.; Gören, A.C.; Bilsel, G.; Bilsel, M.; Tümen, G., Analysis of the essential oil composition of Sideritis albiflora using direct thermal desorption and headspace GC-MS techniques, Turk. J. Chem., 2005, 29, 525-529. [all data]

Tzakou, Bazos, et al., 2005
Tzakou, O.; Bazos, I.; Yannitsaros, A., Essential oils of leaves, inflorescences and infructescences of spontaneous Cotinus coggygria Scop. from Greece, Flavour Fragr. J., 2005, 20, 5, 531-533, https://doi.org/10.1002/ffj.1456 . [all data]

Tzakou and Constantinidis, 2005
Tzakou, O.; Constantinidis, T., Chemotaxonomic significance of volatile compounds in Thymus samius and its related species Thymus atticus and Thymus parnassicus, Biochem. Syst. Ecol., 2005, 33, 11, 1131-1140, https://doi.org/10.1016/j.bse.2005.03.008 . [all data]

Urdampilleta, Amat, et al., 2005
Urdampilleta, J.D.; Amat, A.G.; Bidau, C.J.; Koslobsky, N.K., Biosystematic and chemosystematic studies in five South Americal species of Conyza (Asteraceae), Bol. Soc. Argent. Bot., 2005, 40, 1-2, 101-107. [all data]

Utsunomia, Kawata, et al., 2005
Utsunomia, H.; Kawata, J.; Chanoki, W.; Shirakawa, N.; Miyazawa, M., Components of Essential Oil from Woods of Prunus mume Sieb. at Zucc., J. Oleo Sci., 2005, 54, 11, 609-612, https://doi.org/10.5650/jos.54.609 . [all data]

Velasco-Negueruela, Pérez-Alonso, et al., 2005
Velasco-Negueruela, A.; Pérez-Alonso, M.J.; Palá-Paúl, J.; Iñigo, A.; López, G., The volatile oil composition of the berries of Juniperus macrocarpa Sibth. and Sm., gathered in Spain, J. Essent. Oil Res., 2005, 17, 1, 61-63, https://doi.org/10.1080/10412905.2005.9698831 . [all data]

Vichi, Riu-Aumatell, et al., 2005
Vichi, S.; Riu-Aumatell, M.; Mora-Pons, M.; Buxaderas, S.; Lopez-Tamames, E., Characterization of Volatiles in Different Dry Gins, J. Agric. Food Chem., 2005, 53, 26, 10154-10160, https://doi.org/10.1021/jf058121b . [all data]

Abreu, Reis, et al., 2004
Abreu, I.N.; Reis, M.G.; Marsaioli, A.J.; Mazzafera, P., Essential oil composition of Hypericum brasiliense choise, Flavour Fragr. J., 2004, 19, 1, 80-82, https://doi.org/10.1002/ffj.1319 . [all data]

Agnaniet, Menut, et al., 2004
Agnaniet, H.; Menut, C.; Bessière, J.-M., Aromatic plants of tropical central Africa. Part XLIX: chemical composition of essential oils of the leaf and rhizome of Aframomum giganteum K. Schum from Gabon, Flavour Fragr. J., 2004, 19, 3, 205-209, https://doi.org/10.1002/ffj.1403 . [all data]

Blanc, Muselli, et al., 2004
Blanc, M.-C.; Muselli, A.; Bradesi, P.; Casanova, J., Chemical composition and variability of the essential oil of Inula graveolens from Corsica, Flavour Fragr. J., 2004, 19, 4, 314-319, https://doi.org/10.1002/ffj.1304 . [all data]

Cicció, 2004
Cicció, J.F., A source of almost pure methyl chavicol: volatile oil from the aerial parts of Tagetes lucida (Asteraceae) cultivated in Costa Rica, Rev. Biol. Trop., 2004, 52, 4, 853-857, retrieved from http://www.tropiweb.com. [all data]

Fekam Boyom, Fotio, et al., 2004
Fekam Boyom, F.; Fotio, D.; Amvam Zollo, P.H.; Agnaniet, H.; Menut, C.; Bessière, J.M., Aromatic plants of tropical Central Africa. Part XLIV. Volatile components from Pseudocedrela kotschyi (Schweinf.) harms growing in Cameroon, Flavour Fragr. J., 2004, 19, 1, 9-11, https://doi.org/10.1002/ffj.1254 . [all data]

Gauvin, Ravaomanarivo, et al., 2004
Gauvin, A.; Ravaomanarivo, H.; Smadja, J., Comparative analysis by gas chromatography?mass spectrometry of the essential oils from bark and leaves of Cedrelopsis grevei Baill, an aromatic and medicinal plant from Madagascar, J. Chromatogr. A, 2004, 1029, 1-2, 279-282, https://doi.org/10.1016/j.chroma.2003.12.012 . [all data]

González, Guerra, et al., 2004
González, S.; Guerra, P.E.; Bottaro, H.; Molares, S.; Demo, M.S.; Oliva, M.M.; Zunino, M.P.; Zygadlo, J.A., Aromatic plants from Patagonia. Part I. Antimicrobial activity and chemical composition of Schinus polygamus (Cav.) Cabrera essential oil, Flavour Fragr. J., 2004, 19, 1, 36-39, https://doi.org/10.1002/ffj.1270 . [all data]

bin Jantan, Ayop, et al., 2004
bin Jantan, I.; Ayop, N.; Mohd Ali, N.A.; Ahmad, A.S.; Yalvema, M.F.; Muhammad, K.; Azizi, A.R., The essential oils of Cinnamomum rhyncophyllum Miq. as natural sources of benzyl benzoate, safrole and methyl (E)-cinnamate, Flavour Fragr. J., 2004, 19, 3, 260-262, https://doi.org/10.1002/ffj.1301 . [all data]

JAvidnia, Mojab, et al., 2004
JAvidnia, K.; Mojab, F.; Mojahedi, S.A., Chemical constituents of the essential oil of Stachys lavandulifolia Vahl from Iran, Iranian J. Pharm. Res., 2004, 3, 61-63. [all data]

Kalemba and Thiem, 2004
Kalemba, D.; Thiem, B., Constituents of the essential oils of four micropropagated Solidago species, Flavour Fragr. J., 2004, 19, 1, 40-43, https://doi.org/10.1002/ffj.1271 . [all data]

Kilic, Hafizoglu, et al., 2004
Kilic, A.; Hafizoglu, H.; Kollmannsberger, H.; Nitz, S., Volatile constituents and key odorants in leaves, buds, flowers, and fruits of Laurus nobilis L., J. Agric. Food Chem., 2004, 52, 6, 1601-1606, https://doi.org/10.1021/jf0306237 . [all data]

Lago, de Ávila, et al., 2004
Lago, J.H.G.; de Ávila, P., Jr.; de Aquino, E.M.; Moreno, P.R.H.; Ohara, M.T.; Limberger, R.P.; Apel, M.A.; Henriques, A.T., Volatile oils from leaves and stem barks of Cedrela fissilis (Meliaceae): chemical composition and antibacterial activities, Flavour Fragr. J., 2004, 19, 5, 448-451, https://doi.org/10.1002/ffj.1347 . [all data]

paz Lima, Silva, et al., 2004
paz Lima, M.; Silva, T.M.D.; da Silva, J.D.; Zoghbi, M.G.B.; Andrade, E.H.A., Essential oil composition of leaf and fine stem of Aniba canelilla (Kunth) Mez from Manaus, Brazil., Acta Amazonica, 2004, 34, 2, 329-330, https://doi.org/10.1590/S0044-59672004000200019 . [all data]

Limberger, Sobral, et al., 2004
Limberger, R.P.; Sobral, M.; Henriques, A.T.; Menut, C.; Bessière, J.-M., Óleos voláteis de espécies de Myrcia nativas do rio grande do sul, Quim. Nova, 2004, 27, 6, 916-919, https://doi.org/10.1590/S0100-40422004000600015 . [all data]

Lis, Boczek, et al., 2004
Lis, A.; Boczek, E.; Góra, J., Chemical composition of the essential oils from fruits, leaves and flowers of the Amur cork tree (Phellodendron amurense Rupr.), Flavour Fragr. J., 2004, 19, 6, 549-553, https://doi.org/10.1002/ffj.1349 . [all data]

Lopez Arze, Collin, et al., 2004
Lopez Arze, J.B.; Collin, G.; Garneau, F.-X.; Jean, F.-I.; Gagnon, H., Essential oils from Bolivia. II. Asteraceae: Ophryosporus heptanthus (Wedd.) H. Rob. et King, J. Essent. Oil Res., 2004, 16, 4, 374-376, https://doi.org/10.1080/10412905.2004.9698747 . [all data]

Malencic, Couladis, et al., 2004
Malencic, Dj.; Couladis, M.; Mimica-Dukic, N.; Popovic, M.; Boza, P., Essential oils of three Salvia species from the Pannonian part of Serbia, Flavour Fragr. J., 2004, 19, 3, 225-228, https://doi.org/10.1002/ffj.1291 . [all data]

Marongiu, Porcedda, et al., 2004
Marongiu, B.; Porcedda, A.P.S.; Casu, R.; Pierucci, P., Chemical composition of the oil and supercritical CO2 extract of Schinus molle L., Flavour Fragr. J., 2004, 19, 6, 554-558, https://doi.org/10.1002/ffj.1350 . [all data]

Mehrabani, Asadipour, et al., 2004
Mehrabani, M.; Asadipour, A.; Amoli, S.S., Chemical constituents of the essential oil of NEPETA DEPAUPERATA BENTH. from Iran, DARu: Journal of Faculty of Pharmacy, 2004, 12, 98-100. [all data]

Mimica-Dukic, Bozin, et al., 2004
Mimica-Dukic, N.; Bozin, B.; Sokovic, M.; Simin, N., Antimicrobial and antioxidant activities of Melissa officinalis L. (Lamiaceae) essential oil, J. Agric. Food Chem., 2004, 52, 9, 2485-2489, https://doi.org/10.1021/jf030698a . [all data]

Miyazawa, Fuhita, et al., 2004
Miyazawa, M.; Fuhita, T.; Yamafuji, C.; Matsui, M.; Kasahara, N.; Takagi, Y.; Ishikawa, Y., Chemical composition of volatile oil from the roots of Periploca sepium, J. Oleo Sci., 2004, 53, 10, 511-513, https://doi.org/10.5650/jos.53.511 . [all data]

Miyazawa, Fujita, et al., 2004
Miyazawa, M.; Fujita, T.; Yamafuji, C.; Matsui, M.; Kasahara, N.; Takagi, Y.; Ishikawa, Y., Chemical composition of volatile oil from the roots of Periploca sepium, J. Oleo Sci., 2004, 53, 11, 511-513, https://doi.org/10.5650/jos.53.511 . [all data]

Nik, Mirza, et al., 2004
Nik, Z.B.; Mirza, M.; Shahmir, F., Essential oil of Marrubium cuneatum Russell and its secretory elements, Flavour Fragr. J., 2004, 19, 3, 233-235, https://doi.org/10.1002/ffj.1293 . [all data]

Orav, Stulova, et al., 2004
Orav, A.; Stulova, I.; Kailas, T.; Müürisepp, M., Effect of storage on the essential oil composition of piper nigrum L. fruits of different ripening states, J. Agric. Food Chem., 2004, 52, 9, 2582-2586, https://doi.org/10.1021/jf030635s . [all data]

Palá-Paúl, Brophy, et al., 2004
Palá-Paúl, J.; Brophy, J.J.; Goldsack, R.J.; Fontaniella, B., Analysis of the volatile components of Lavandula canariensis (L.) Mill., a Canary Islands endemic species, growing in Australia, Biochem. Syst. Ecol., 2004, 32, 1, 55-62, https://doi.org/10.1016/S0305-1978(03)00177-7 . [all data]

Palá-Paúl, Velasco-Negueruela, et al., 2004
Palá-Paúl, J.; Velasco-Negueruela, A.; Pérez-Alonso, M.J.; Maqueda, J.; Sanz, J., Volatile oil constituents from different parts of Cachrys trifida L., J. Essent. Oil Res., 2004, 16, 4, 347-349, https://doi.org/10.1080/10412905.2004.9698738 . [all data]

Raal, Paaver, et al., 2004
Raal, A.; Paaver, U.; Arak, E.; Orav, A., Content and composition of the essential oil of Thymus serpyllum L. growing wild in Estonia, Medicina (Kaunas), 2004, 40, 8, 795-800. [all data]

Rohloff, Mordal, et al., 2004
Rohloff, J.; Mordal, R.; Dragland, S., Chemotypical variation of tansy (Tanacetum vulgare L.) from 40 different locations in Norway, J. Agric. Food Chem., 2004, 52, 6, 1742-1748, https://doi.org/10.1021/jf0352430 . [all data]

Sarkhail, Amin, et al., 2004
Sarkhail, P.; Amin, G.; Shafiee, A., Composition of the essential oil of Phlomis persica Boiss and Phlomis chorassanica Bunge from Iran, Flavour Fragr. J., 2004, 19, 6, 538-540, https://doi.org/10.1002/ffj.1338 . [all data]

Senatore, Napolitano, et al., 2004
Senatore, F.; Napolitano, F.; Mohamed, M.A.-H.; Harris, P.J.C.; MnKeni, P.N.S.; Henderson, J., Antibacterial activity of Tagetes minuta L. (Asteraceae) essential oil with different chemical composition, Flavour Fragr. J., 2004, 19, 6, 574-578, https://doi.org/10.1002/ffj.1358 . [all data]

Senatore, Rigano, et al., 2004
Senatore, F.; Rigano, D.; de Fusco, R.; Bruno, M., Composition of the essential oil from flowerheads of Chrysanthemum coronarium L. (Asteraceae) growing wild in Southern Italy, Flavour Fragr. J., 2004, 19, 2, 149-152, https://doi.org/10.1002/ffj.1285 . [all data]

Simic, Sokovic, et al., 2004
Simic, A.; Sokovic, M.D.; Ristic, M.; Grujic-Jovanovic, S.; Vukojevic, J.; Marin, P.D., The chemical composition of some Lauraceae essential oils and their antifungal activities, Phytother. Res., 2004, 18, 9, 713-717, https://doi.org/10.1002/ptr.1516 . [all data]

Suyenaga, Apel, et al., 2004
Suyenaga, E.S.; Apel, M.A.; Chaves, C.G.; Zuanazzi, J.A.; Henriques, A.T., Essential oil composition of Heterothalamus psiadioides Less, Biochem. Syst. Ecol., 2004, 32, 1, 83-86, https://doi.org/10.1016/S0305-1978(03)00190-X . [all data]

Tellez, Khan, et al., 2004
Tellez, M.R.; Khan, I.A.; Schaneberg, B.T.; Crockett, S.L.; Rimando, A.M.; Kobaisy, M., Steam distillation-solid-phase microextraction for the detection of Ephedra sinica in herbal preparations, J. Chromatogr. A, 2004, 1025, 1, 51-56, https://doi.org/10.1016/S0021-9673(03)01035-5 . [all data]

Thappa, Bakshi, et al., 2004
Thappa, R.K.; Bakshi, S.K.; Dhar, L.; Agarwal, S.G.; Kitchlu, S.; Kaul, M.K.; Suri, K.A., Significance of changed climatic factors on essential oil composition of Echinacea purpurea under subtropical conditions, Flavour Fragr. J., 2004, 19, 5, 452-454, https://doi.org/10.1002/ffj.1352 . [all data]

Tirillini, Pellegrino, et al., 2004
Tirillini, B.; Pellegrino, R.; Bini, L.M., Essential oil composition of Stachys sylvatica L. from Italy, Flavour Fragr. J., 2004, 19, 4, 330-332, https://doi.org/10.1002/ffj.1308 . [all data]

Bertoli, Menichini, et al., 2003
Bertoli, A.; Menichini, F.; Mazzetti, M.; Spinelli, G.; Morelli, I., Volatile constituents of the leaves and flowers of Hypericum triquetrifolium Turra, Flavour Fragr. J., 2003, 18, 2, 91-94, https://doi.org/10.1002/ffj.1161 . [all data]

Chaves, Lago, et al., 2003
Chaves, M.H.; Lago, J.H.G.; Roque, N.F., Macrocarpane, a new sesquiterpene skeleton from the leaves of Porcelia macrocarpa, J. Braz. Chem. Soc., 2003, 14, 1, 16-19, retrieved from http://jbcs.sbq.org.br/jbcs/2003/v14n1/03.pdf, https://doi.org/10.1590/S0103-50532003000100004 . [all data]

Couladis, Özcan, et al., 2003
Couladis, M.; Özcan, M.; Tzakou, O.; Akgül, A., Comparative essential oil composition of various parts of the turpentine tree (Pistacia terebinthus L) growing wild in Turkey, J. Sci. Food Agric., 2003, 83, 2, 136-138, https://doi.org/10.1002/jsfa.1295 . [all data]

Dudai, Larkov, et al., 2003
Dudai, N.; Larkov, O.; Chaimovitsh, D.; Lewinsohn, E.; Freiman, L.; Ravid, U., Essential oil compounds of Origanum dayi Post, Flavour Fragr. J., 2003, 18, 4, 334-337, https://doi.org/10.1002/ffj.1237 . [all data]

Feizbaksh, Saber Tehrani, et al., 2003
Feizbaksh, A.; Saber Tehrani, M.; Rustaiyan, A.; Masoudi, S., Composition of the essential oil of Stachys lavandulifolia Vahl. from Iran, J. Essent. Oil Res., 2003, 15, 2, 72-73, https://doi.org/10.1080/10412905.2003.9712068 . [all data]

Fekam Boyom, Amvam Zollo, et al., 2003
Fekam Boyom, F.; Amvam Zollo, P.H.; Agnaniet, H.; Menut, C.; Bessière, J.M., Aromatic plants of tropical central Africa. Part XLIII volatiles components from Uvariastrum pierreanum Engl. (Engl. Diels) growing in Cameroon, Flavour Fragr. J., 2003, 18, 4, 296-298, https://doi.org/10.1002/ffj.1218 . [all data]

Fekam Boyom, Ngouana, et al., 2003
Fekam Boyom, F.; Ngouana, V.; Amvam Zollo, P.H.; Menut, C.; Bessiere, J.M.; Gut, J.; Rosenthal, P.J., Composition and anti-plasmodial activities of essential oils from some Cameroonian medicinal plants, Phytochemistry, 2003, 64, 7, 1269-1275, https://doi.org/10.1016/j.phytochem.2003.08.004 . [all data]

Ghannadi, Aghazari, et al., 2003
Ghannadi, A.; Aghazari, F.; Mehrabani, M.; Mohagheghzadeh, A.; Mehregan, I., Quantity and composition of the SDE prepared essential oil of Nepeta macrosiphon Boiss, Iran. J. Pharm. Res., 2003, 2, 103-105. [all data]

Ghasemi, Asghari, et al., 2003
Ghasemi, N.; Asghari, G.; Ardakani, M.S.; Siahpoush, A., Characterization of volatile constituents from aerial parts of varthemia persica DC (var. persica), Iran. J. Pharm. Res., 2003, 2, 241-243. [all data]

Jayaprakasha, Rao, et al., 2003
Jayaprakasha, G.K.; Rao, L.J.M.; Sakariah, K.K., Volatile constituents from Cinnamomum zeylanicum fruit stalks and their antioxidant activities, J. Agric. Food Chem., 2003, 51, 15, 4344-4348, https://doi.org/10.1021/jf034169i . [all data]

Jirovetz, Buchbauer, et al., 2003
Jirovetz, L.; Buchbauer, G.; Shafi, M.P.; Kaniampady, M.M., Chemotaxonomical analysis of the essential oil aroma compounds of four different Ocimumspecies from southern India, Eur. Food Res. Technol., 2003, 217, 2, 120-124, https://doi.org/10.1007/s00217-003-0708-1 . [all data]

Jirovetz, Buchbauer, et al., 2003, 2
Jirovetz, L.; Buchbauer, G.; Shafi, M.P.; Leela, N.K., Analysis of the essential oils of the leaves, stems, rhizomes and roots of the medicinal plant Alpinia galanga from southern India, Acta Pharm. Hung., 2003, 53, 73-81. [all data]

Juteau, Jerkovic, et al., 2003
Juteau, F.; Jerkovic, I.; Masotti, V.; Milos, M.; Mastelic, J.; Bessière, J.-M.; Viano, J., Composition and antimicrobial activity of the essential oil of Artemisia absinthium from Croatia and France, Planta Medica, 2003, 69, 2, 158-161, https://doi.org/10.1055/s-2003-37714 . [all data]

Kanjilal, Kotoky, et al., 2003
Kanjilal, P.B.; Kotoky, R.; Singh, R.S., Chemical composition of the leaf oil of Altingia excelsa Nornha, Flavour Fragr. J., 2003, 18, 5, 449-450, https://doi.org/10.1002/ffj.1250 . [all data]

Khanavi, Hadjiakhoondi, et al., 2003
Khanavi, M.; Hadjiakhoondi, A.; Shafiee, A.; Masoudi, S.; Rustaiyan, A., Chemical composition of the essential oil of Stachys byzanthin C. Koch. from Iran, J. Essent. Oil Res., 2003, 15, 2, 77-78, https://doi.org/10.1080/10412905.2003.9712070 . [all data]

Limberger, Simões-Pires, et al., 2003
Limberger, R.P.; Simões-Pires, C.A.; Sobral, M.; Menut, C.; Bessiere, J.-M.; Henriques, A.T., Essential oils of six Gomidesia spp. from southern Brazil, Flavour Fragr. J., 2003, 18, 2, 144-147, https://doi.org/10.1002/ffj.1122 . [all data]

Maia, Taveira, et al., 2003
Maia, J.G.S.; Taveira, F.S.N.; Andrade, E.H.A.; da Silva, M.H.L.; Zoghbi, M.G.B., Essential oils of Lippia grandis Schau., Flavour Fragr. J., 2003, 18, 5, 417-420, https://doi.org/10.1002/ffj.1241 . [all data]

Marongiu, Porcedda, et al., 2003
Marongiu, B.; Porcedda, S.; Caredda, A.; de Gioannis, B.; Vargiu, L.; la Colla, P., Extraction of Juniperus oxycedrus ssp. Oxycedrus essential oil by supercritical carbon dioxide: influence of some process parameters and biological activity, Flavour Fragr. J., 2003, 18, 5, 390-397, https://doi.org/10.1002/ffj.1224 . [all data]

Masotti, Juteau, et al., 2003
Masotti, V.; Juteau, F.; Bessière, J.M.; Viano, J., Seasonal and phenological variations of the essential oil from the narrow endemic species Artemisia molinieri and its biological activities, J. Agric. Food Chem., 2003, 51, 24, 7115-7121, https://doi.org/10.1021/jf034621y . [all data]

Mazloomifar, Saber-Tehrani, et al., 2003
Mazloomifar, H.; Saber-Tehrani, M.; Rustaiyan, A.; Masoudi, S., Chemical composition of the essential oil of Ajuga chamaecistus Ging. ssp. chamaecistus from Iran, J. Essent. Oil Res., 2003, 15, 1, 17-18, https://doi.org/10.1080/10412905.2003.9712250 . [all data]

Mirza, Nik, et al., 2003
Mirza, M.; Nik, Z.B.; Dini, M., Chemical composition of the essential oils of astrodaucus orientalis (L.) Drude leaves and seeds, Flavour Fragr. J., 2003, 18, 3, 205-206, https://doi.org/10.1002/ffj.1184 . [all data]

Mookdasanit, Tamura, et al., 2003
Mookdasanit, J.; Tamura, H.; Yoshizawa T.; Tokunaga T.; Nakanishi, K., Trace Volatile Compounds in Essential Oil of Citrus Sudachi by Means of Modified Solvent Extraction Method, Food Sci Technol. Res., 2003, 9, 1, 54-61, https://doi.org/10.3136/fstr.9.54 . [all data]

Morteza-Semnani and Saeedi, 2003
Morteza-Semnani, K.; Saeedi, M., Constituents of the essential oil of Commiphora myrrha (Nees) Engl. var. molmol, J. Essent. Oil Res., 2003, 15, 1, 50-51, https://doi.org/10.1080/10412905.2003.9712264 . [all data]

Orav, Kailas, et al., 2003
Orav, A.; Kailas, T.; Jegorova, A., Composition of the essential oil of dill, celery, and parsley from Estonia, Proc. Est. Acad. Sci. Chem., 2003, 52, 4, 147-154. [all data]

Oyedeji, Ekundayo, et al., 2003
Oyedeji, O.A.; Ekundayo, O.; König, W.A., Volatile leaf oil constituents of Lantana camara L. from Nigeria, Flavour Fragr. J., 2003, 18, 5, 384-386, https://doi.org/10.1002/ffj.1206 . [all data]

Perez-Alonso, Velasco-Negueruela, et al., 2003
Perez-Alonso, M.J.; Velasco-Negueruela, A.; Palá-Paúl, J.; Sanz, J., Variations in the essential oil composition of Artemisia pedemontana gathered in Spain: chemotype camphor-1,8-cineole and chemotype davanone, Biochem. Syst. Ecol., 2003, 31, 1, 77-84, https://doi.org/10.1016/S0305-1978(02)00082-0 . [all data]

Pino, Marbot, et al., 2003
Pino, J.A.; Marbot, R.; Fuentes, V., Characterization of volatiles in Bullock's heart (Annona reticulata L.) fruit cultivars from Cuba, J. Agric. Food Chem., 2003, 51, 13, 3836-3839, https://doi.org/10.1021/jf020733y . [all data]

Pitarokili, Tzakou, et al., 2003
Pitarokili, D.; Tzakou, O.; Loukis, A.; Harvala, C., Volatile metabolites from Salvia fruticosa as antifungal agents in soilborne pathogens, J. Agric. Food Chem., 2003, 51, 11, 3294-3301, https://doi.org/10.1021/jf0211534 . [all data]

Pourmortazavi, Sefidkon, et al., 2003
Pourmortazavi, S.M.; Sefidkon, F.; Hosseini, S.G., Supercritical carbon dioxide extraction of essential oils from Perovskia atriplicifolia Benth., J. Agric. Food Chem., 2003, 51, 18, 5414-5419, https://doi.org/10.1021/jf0341619 . [all data]

Raal, Arak, et al., 2003
Raal, A.; Arak, E.; Orav, A.; Ivask, K., Comparison of essential oil content of Matricaria recutita L. from different origins, Ars Pharm., 2003, 44, 2, 159-165, retrieved from http://www.ugr.es/~ars/abstract/44-159-03.pdf. [all data]

Rasooli and Mirmostafa, 2003
Rasooli, I.; Mirmostafa, S.A., Bacterial susceptibility to and chemical composition of essential oils from Thymus kotschyanus and Thymus persicus, J. Agric. Food Chem., 2003, 51, 8, 2200-2205, https://doi.org/10.1021/jf0261755 . [all data]

Rotman, Ahumada, et al., 2003
Rotman, A.; Ahumada, O.; Demo, M.S.; Oliva, M.M.; Turina, A.V.; López, M.L.; Zygadlo, J.A., Aromatic plants from Yungas. Part III. Composition and antimicrobial activity of Myrrhinium atropurpureum Schott var. octandrum Bentham essential oil, Flavour Fragr. J., 2003, 18, 3, 211-214, https://doi.org/10.1002/ffj.1189 . [all data]

Sajjadi and Mehregan, 2003
Sajjadi, S.E.; Mehregan, I., Chemical composition of the essential oil of Prangos Asperula Boiss. subsp. haussknechtii (Boiss.) Hernst. et Heyn fruits, 2003, retrieved from http://www1.tums.ac.ir/daru/daru2%2020003/Dr%20Sajadi.PDF. [all data]

Sajjadi and Mehregan, 2003, 2
Sajjadi, S.E.; Mehregan, I., Composition of the essential oil of Stachys Iaxa Boiss. Buhse, Iran. J. Pharm. Res., 2003, 57-58. [all data]

Senatore and Bruno, 2003
Senatore, F.; Bruno, M., Composition of the essential oil of Pallenis spinosa (L.) Cass. (Asteraceae), Flavour Fragr. J., 2003, 18, 3, 195-197, https://doi.org/10.1002/ffj.1180 . [all data]

Shahmir, Ahmadi, et al., 2003
Shahmir, F.; Ahmadi, L.; Mirza, M.; Korori, S.A.A., Secretory elements of needles and berries of Juniperus communis L. ssp. communis and its volatile constituents, Flavour Fragr. J., 2003, 18, 5, 425-428, https://doi.org/10.1002/ffj.1243 . [all data]

da Silva, Luz, et al., 2003
da Silva, J.D.; Luz, A.I.R.; da Silva, M.H.L.; Andrade, E.H.A.; Soghbi, M.G.B.; Maia, J.G.S., Essential oils of the leaves and stems of four Psidium spp., Flavour Fragr. J., 2003, 18, 3, 240-243, https://doi.org/10.1002/ffj.1219 . [all data]

Stashenko, Jaramillo, et al., 2003
Stashenko, E.E.; Jaramillo, B.E.; Martínez, J.R., Comparación de la composición química y de la actividad antioxidante in vitro de los metabolitos secundarios volátiles de plantas de la familia verbenaceae, Rev. Acad. Colomb. Cienc. Exactas Fis. Nat., 2003, 27, 105, 579-597. [all data]

Taveira, de Lima, et al., 2003
Taveira, F.S.N.; de Lima, W.N.; Andrade, E.H.A.; Maia, J.G.S., Seasonal essential oil variation of Aniba canelilla, Biochem. Syst. Ecol., 2003, 31, 1, 69-75, https://doi.org/10.1016/S0305-1978(02)00088-1 . [all data]

Velickovic, Randjelovic, et al., 2003
Velickovic, D.T.; Randjelovic, N.V.; Ristic, M.S.; Velickovic, A.S.; Smelcerovic, A.A., Chemical constituents and antimicrobial activity of the ethanol extracts obtained from the flower, leaf, and stem of Salvia officinalis L., J. Serb. Chem. Soc., 2003, 68, 1, 17-24, https://doi.org/10.2298/JSC0301017V . [all data]

Velickovic, Ristic, et al., 2003
Velickovic, A.S.; Ristic, M.S.; Velickovic, D.T.; Ilic, S.; Mitic, N.D., The possibilities of the application of some species of sage (Salvia L.) as auxiliaries in the treatment of some diseases, J. Serb. Chem. Soc., 2003, 68, 6, 435-445, https://doi.org/10.2298/JSC0306435V . [all data]

Yassa, Akhani, et al., 2003
Yassa, N.; Akhani, H.; Aqaahmadi, M.; Salimian, M., Essential oils from two endemic species of Apiaceae from Iran, Z. Naturforsch. C:, 2003, 58, 459-463. [all data]

Zoghbi, Andrade, et al., 2003
Zoghbi, M.G.B.; Andrade, E.H.A.; da Silva, M.H.; Carreira, L.M.M.; Maia, J.G.S., Essential oils from three Myrcia species, Flavour Fragr. J., 2003, 18, 5, 421-424, https://doi.org/10.1002/ffj.1242 . [all data]

Zrira, Elamrani, et al., 2003
Zrira, S.; Elamrani, A.; Benjilali, B., Chemical composition of the essential oil of Pistacia lentiscus L. from Morocco - a seasonal variation, Flavour Fragr. J., 2003, 18, 6, 475-480, https://doi.org/10.1002/ffj.1221 . [all data]

Ahmadi, Mirza, et al., 2002
Ahmadi, L.; Mirza, M.; Shahmir, F., The volatile constituents of Artemisia marschaliana Sprengel and its secretory elements, Flavour Fragr. J., 2002, 17, 2, 141-143, https://doi.org/10.1002/ffj.1055 . [all data]

Bos, Koulman, et al., 2002
Bos, R.; Koulman, A.; Woerdenbag, H.J.; Quax, W.J.; Pras, N., Volatile components from Anthriscus sylvestris (L.) Hoffm., J. Chromatogr. A, 2002, 966, 1-2, 233-238, https://doi.org/10.1016/S0021-9673(02)00704-5 . [all data]

Boyom, Keumedjio, et al., 2002
Boyom, F.F.; Keumedjio, F.; Dongmo, P.M.J.; Ngadjui, B.T.; Zollo, A.; Menut, C.; Bessiere, J.M., Essential oils from Croton zambesicus Muell. Arg. growing in Cameroon, Flavour Fragr. J., 2002, 17, 3, 215-217, https://doi.org/10.1002/ffj.1081 . [all data]

Cavaleiro, Salgueiro, et al., 2002
Cavaleiro, C.; Salgueiro, L.; Barroso, J.G.; Figueiredo, A.C.; Pedro, L.G.; Fontinha, S.S.; Bighelli, A.; Casanova, J.; Looman, A.; Scheffer, J.J.C., Composition of the essential oil of Juniperus cedrus Webb and Berth. grown on Madeira, Flavour Fragr. J., 2002, 17, 2, 111-114, https://doi.org/10.1002/ffj.1061 . [all data]

Cicció and Gómez-Laurito, 2002
Cicció, J.F.; Gómez-Laurito, J., Volatile constituents of the leaves of Siparuna thecaphora (Siparunaceae) from Turrialba, Costa Rica, Rev. Biol. Trop., 2002, 50, 3/4, 963-967. [all data]

Congiu, Falconieri, et al., 2002
Congiu, R.; Falconieri, D.; Marongiu, B.; Piras, A.; Porcedda, S., Extraction and isolation of Pistacia lentiscus L. essential oil by supercritical CO2, Flavour Fragr. J., 2002, 17, 4, 239-244, https://doi.org/10.1002/ffj.1095 . [all data]

Das, Ram, et al., 2002
Das, M.; Ram, G.; Singh, A.; Mallavarapu, G.R.; Ramesh, S.; Ram, M.; Kumar, S., Volatile constituents of different plant parts of Chamomilla recutita L. Rausch grown in the Indo-Gangetic plains, Flavour Fragr. J., 2002, 17, 1, 9-12, https://doi.org/10.1002/ffj.1035 . [all data]

Diaz and Kite, 2002
Diaz, A.; Kite, G.C., A comparison of the pollination ecology of Arum maculatum and A. italicum in England, Watsonia, 2002, 24, 171-181. [all data]

Flamini, Ertugrul, et al., 2002
Flamini, G.; Ertugrul, K.; Cioni, P.L.; Morelli, I.; Dural, H.; Bagci, Y., Volatile constituents of two endemic Centaurea species from Turkey: C. pseudoscabiosa subsp. pseudoscabiosa and C. hadimensis, Biochem. Syst. Ecol., 2002, 30, 10, 953-959, https://doi.org/10.1016/S0305-1978(02)00043-1 . [all data]

Gancel, Ollé, et al., 2002
Gancel, A.-L.; Ollé, D.; Ollitrault, P.; Luro, F.; Brillouet, J.-M., Leaf and peel volatile compounds of an interspecific citrus somatic hybrid [Citrus aurantifolia (Christm.) Swing. + Citrus paradisi Macfayden], Flavour Fragr. J., 2002, 17, 6, 416-424, https://doi.org/10.1002/ffj.1119 . [all data]

Gudzic, Djokovic, et al., 2002
Gudzic, B.; Djokovic, D.; Vajs, V.; Palic, R.; Stojanovic, G., Composition and antimicrobial activity of the essential oil of Hypericum maculatum Crantz, Flavour Fragr. J., 2002, 17, 5, 392-394, https://doi.org/10.1002/ffj.1112 . [all data]

Iñigo, Palá-Paúl, et al., 2002
Iñigo, A.; Palá-Paúl, J.; Pérez-Alonso, M.J.; Velasco-Negueruela, A., Essential oil composition from the aerial parts of Haplophyllum linifolium (L.) G. Don fil., Botanica Complutensis, 2002, 26, 79-83. [all data]

Jirovetz, Buchbauer, et al., 2002
Jirovetz, L.; Buchbauer, G.; Ngassoum, M.B.; Geissler, M., Aroma compound analysis of Piper nigrum and Piper guineense essential oils from Cameroon using solid-phase microextraction-gas chromatography, solid-phase microextraction-gas chromatography-mass spectrometry and olfactometry, J. Chromatogr. A, 2002, 976, 1-2, 265-275, https://doi.org/10.1016/S0021-9673(02)00376-X . [all data]

Jirovetz, Smith, et al., 2002
Jirovetz, L.; Smith, D.; Buchbauer, G., Aroma compound analysis of Eruca sativa (Brassicaceae) SPME headspace leaf samples using GC, GC-MS, and olfactometry, J. Agric. Food Chem., 2002, 50, 16, 4643-4646, https://doi.org/10.1021/jf020129n . [all data]

Juteau, Masotti, et al., 2002
Juteau, F.; Masotti, V.; Bessière, J.-M., Compositional characteristics of the essential oil of Artemisia campestris var. glutinosa, Biochem. Syst. Ecol., 2002, 30, 11, 1065-1070, https://doi.org/10.1016/S0305-1978(02)00052-2 . [all data]

Kabouss, Charrouf, et al., 2002
Kabouss, A.E.; Charrouf, Z.; Faid, M.; Garneau, F.-X.; Collin, G., Chemical composition and antimicrobial activity of the leaf essential oil of Argania spinosa L. Skeels, J. Essent. Oil Res., 2002, 14, 2, 147-149, https://doi.org/10.1080/10412905.2002.9699801 . [all data]

Khallouki, Younos, et al., 2002
Khallouki, F.; Younos, C.; Soulimani, R.; Bessière, J.M., Chemical composition of the essential oils of Annona cuneata L. and Annona senegalensis Pers. stem barks, Flavour Fragr. J., 2002, 17, 5, 398-400, https://doi.org/10.1002/ffj.1115 . [all data]

Kobaisy, Tellez, et al., 2002
Kobaisy, M.; Tellez, M.R.; Dayan, F.E.; Duke, S.O., Phytotoxicity and volatile constituents from leaves of Callicarpa japonica Thunb., Phytochemistry, 2002, 61, 1, 37-40, https://doi.org/10.1016/S0031-9422(02)00207-8 . [all data]

Krauze-Baranowska, Mardarowicz, et al., 2002
Krauze-Baranowska, M.; Mardarowicz, M.; Wiwart, M.; Poblocka, L.; Dynowska, M., Antifungal activity of the essential oils from some species of the genus Pinus, Z. Naturforsch., 2002, 57c, 478-482. [all data]

Krauze-Baranowska, Mardarowicz, et al., 2002, 2
Krauze-Baranowska, M.; Mardarowicz, M.; Wiwart, M., The chemical composition of Microbiota decussata, Z. Naturforsch. C:, 2002, 57c, 998-1003. [all data]

Kuiate, Bessière, et al., 2002
Kuiate, J.-R.; Bessière, J.-M.; Zollo, P.-H.A., Composition of the essential oils from three Laggera Spp. from Cameroon, Flavour Fragr. J., 2002, 17, 2, 105-108, https://doi.org/10.1002/ffj.1057 . [all data]

Lago, Reis, et al., 2002
Lago, J.H.G.; Reis, A.A.; Roque, N.F., Chemical composition from volatile oil of the stem bark of Guarea macrophylla Vahl. ssp. tuberculata Vellozo (Meliaceae), Flavour Fragr. J., 2002, 17, 4, 255-257, https://doi.org/10.1002/ffj.1091 . [all data]

Limberger, Simões-Pires, et al., 2002
Limberger, R.P.; Simões-Pires, C.; Sobral, M.; Menu, C.; Bessiere, J.-M.; Henriques, A.T., Essential oils from some Myrceugenia species (Myrtaceae), Flavour Fragr. J., 2002, 17, 5, 341-344, https://doi.org/10.1002/ffj.1113 . [all data]

Lockwood, Asghari, et al., 2002
Lockwood, G.B.; Asghari, G.; Hakimi, B., Production of essential oil constituents by cultured cells of Carum copticum L., Flavour Fragr. J., 2002, 17, 6, 456-458, https://doi.org/10.1002/ffj.1129 . [all data]

Mahmout, Bessière, et al., 2002
Mahmout, Y.; Bessière, J.-M.; Dolmazon, R., Constituents of the essential oil of Cyperus maculatus Boëck, J. Essent. Oil Res., 2002, 14, 4, 263-265, https://doi.org/10.1080/10412905.2002.9699848 . [all data]

Maia, da Silva, et al., 2002
Maia, J.G.S.; da Silva, M.H.L.; Andrade, E.H.A.; Zoghbi, M.G.B.; Carreira, L.M.M., Essential oils from Astronium urundeuva (Allemao) Engl. and A. fraxinifolium Schott ex Spreng., Flavour Fragr. J., 2002, 17, 1, 72-74, https://doi.org/10.1002/ffj.1046 . [all data]

Maia, Zoghbi, et al., 2002
Maia, J.G.S.; Zoghbi, M.G.B.; Andrade, E.H.A.; da Silva, M.H.L.; Luz, A.I.R.; da Silva, J.D., Essential oils composition of Eupatorium species growing wild in the Amazon, Biochem. Syst. Ecol., 2002, 30, 11, 1071-1077, https://doi.org/10.1016/S0305-1978(02)00059-5 . [all data]

Menut, Bessière, et al., 2002
Menut, C.; Bessière, J.M.; Hassani, M.S.; Buchbauer, G.; Schopper, B., Chemical and biological studies of Ocotea comoriensis bark essential oil, Flavour Fragr. J., 2002, 17, 6, 459-461, https://doi.org/10.1002/ffj.1130 . [all data]

Norouzi-Arasi, Yavari, et al., 2002
Norouzi-Arasi, H.; Yavari, I.; Ghaffarzadeh, F.; Mortazavi, M.-S., Volatile constituents of Cymbopogon olivieri (Boiss.) Bor from Iran, Flavour Fragr. J., 2002, 17, 4, 272-274, https://doi.org/10.1002/ffj.1096 . [all data]

Orav, Kailas, et al., 2002
Orav, A.; Kailas, T.; Müürisepp, M., Composition of blackcurrant aroma isolated from leaves, buds, and berries of Ribes nigrum L., Proc. Est. Acad. Sci. Chem., 2002, 51, 4, 225-234. [all data]

Phutdhawong, Korth, et al., 2002
Phutdhawong, W.; Korth, J.; Buddhasukh, D.; Pyne, S.G., Volatile components from Cephalotaxus griffithii growing in northern Thailand, Flavour Fragr. J., 2002, 17, 2, 153-155, https://doi.org/10.1002/ffj.1064 . [all data]

Schwob, Bessière, et al., 2002
Schwob, I.; Bessière, J.-M.; Viano, J., Composition of the essential oils of Hypericum perforatum L. from southeastern France, C.R. Acad. Sci. Ser. 3:, 2002, 325, 781-785. [all data]

Sefidkon, Dabiri, et al., 2002
Sefidkon, F.; Dabiri, M.; Alamshahi, A., Analysis of the essential oil of Nepeta fissa C.A. Mey from Iran, Flavour Fragr. J., 2002, 17, 2, 89-90, https://doi.org/10.1002/ffj.1045 . [all data]

Velasco-Negueruela, Pérez-Alonso, et al., 2002
Velasco-Negueruela, A.; Pérez-Alonso, M.J.; Palá-Paúl, J.; Íñigo, A.; López, G., Leaf essential oils analysis of Juniperus navicularis Gandoger, Botanica Complutensis, 2002, 26, 85-91. [all data]

Velickovic, Randjelovic, et al., 2002
Velickovic, D.T.; Randjelovic, N.V.; Ristic, M.S.; Smelcerovic, A.A.; Velickovic, A.S., Chemical composition and antimicrobial action of the ethanol extracts of Salvia pratensis L., Salvia glutinosa L. and Salvia aethiopis L., J. Serb. Chem. Soc., 2002, 67, 10, 639-646, https://doi.org/10.2298/JSC0210639V . [all data]

Zoghbi, Andrade, et al., 2002
Zoghbi, M.G.B.; Andrade, E.H.A.; da Silva, M.H.L.; Maia, J.G.S., Volatile constituents of Lippia lupulina Cham., Flavour Fragr. J., 2002, 17, 1, 29-31, https://doi.org/10.1002/ffj.1032 . [all data]

Zoghbi, Andrade, et al., 2002, 2
Zoghbi, M.G.B.; Andrade, E.H.A.; da Silva, M.H.; Maia, J.G.S.; Luz, A.I.R.; da Silva, J.D., Chemical variation in the essential oils of Hyptis crenata Pohl ex Benth., Flavour Fragr. J., 2002, 17, 1, 5-8, https://doi.org/10.1002/ffj.1031 . [all data]

Bailac, Dellacasa, et al., 2001
Bailac, P.N.; Dellacasa, A.D.; Bernasconi, H.O.; Ponzi, M.I.; Firpo, N.H., Essential oil of female plants of Baccharis coridifolia De Candole, J. Essent. Oil Res., 2001, 13, 1, 23-24, https://doi.org/10.1080/10412905.2001.9699593 . [all data]

Cornu, Carnat, et al., 2001
Cornu, A.; Carnat, A.-P.; Martin, B.; Coulon, J.-B.; Lamaison, J.-L.; Berdagué, J.-L., Solid-phase microextraction of volatile components from natural grassland plants, J. Agric. Food Chem., 2001, 49, 1, 203-209, https://doi.org/10.1021/jf0008341 . [all data]

Dabiri and Sefidkon, 2001
Dabiri, M.; Sefidkon, F., Analysis of the essential oil from aerial parts of Perovskia atriplicifolia Benth. at different stages of plant growth, Flavour Fragr. J., 2001, 16, 6, 435-438, https://doi.org/10.1002/ffj.988 . [all data]

Flamini, Cioni, et al., 2001
Flamini, G.; Cioni, P.L.; Morelli, I.; Maccioni, S.; Monti, G., Composition of the essential oil of Teucrium fruticans L. from the Maremma Regional Park (Tuscany, Italy), Flavour Fragr. J., 2001, 16, 5, 367-369, https://doi.org/10.1002/ffj.1014 . [all data]

Gallori, Flamini, et al., 2001
Gallori, S.; Flamini, G.; Bilia, A.R.; Morelli, I.; Landini, A.; Vincieri, F.F., Chemical composition of some traditional herbal drug preparations: essential oil and aromatic water of costmary (Balsamita suaveolens Pers.), J. Agric. Food Chem., 2001, 49, 12, 5907-5910, https://doi.org/10.1021/jf0107656 . [all data]

Gupta, Mallavarapu, et al., 2001
Gupta, R.; Mallavarapu, G.R.; Banerjee, S.; Kumar, S., Characteristics of an isomenthone-rich somaclonal mutant isolated in a geraniol-rich rose-scented geranium accession of Pelargonium graveolens, Flavour Fragr. J., 2001, 16, 5, 319-324, https://doi.org/10.1002/ffj.1002 . [all data]

Jacquemond-Collet, Bessière, et al., 2001
Jacquemond-Collet, I.; Bessière, J.-M.; Hannedouche, S.; Bertrand, C.; Fourasté, I.; Moulis, C., Identification of the alkaloids of Galipea officinalis by gas chromatography-mass spectrometry, Phytochem. Anal., 2001, 12, 5, 312-319, https://doi.org/10.1002/pca.594 . [all data]

Kalemba, Marschall, et al., 2001
Kalemba, D.; Marschall, H.; Bradesi, P., Constituents of the essential oil of Solidago gigantea Ait. (giant goldenrod), Flavour Fragr. J., 2001, 16, 1, 19-26, https://doi.org/10.1002/1099-1026(200101/02)16:1<19::AID-FFJ940>3.0.CO;2-U . [all data]

Marongiu, Porcedda, et al., 2001
Marongiu, B.; Porcedda, S.; Porta, G.D.; Reverchon, E., Extraction and isolation of Salvia desoleana and Mentha spicata subsp. insularis essential oils by supercritical CO2, Flavour Fragr. J., 2001, 16, 5, 384-388, https://doi.org/10.1002/ffj.1021 . [all data]

Mirza, Ahmadi, et al., 2001
Mirza, M.; Ahmadi, L.; Tayebi, M., Volatile constituents of Hymenocrater incanus Bunge, an Iranian endemic species, Flavour Fragr. J., 2001, 16, 4, 239-240, https://doi.org/10.1002/ffj.983 . [all data]

Orav and Kann, 2001
Orav, A.; Kann, J., Determination of peppermint and orange aroma compounds in food and beverages, Proc. Est. Acad. Sci. Chem., 2001, 50, 4, 217-225. [all data]

Palmeira, Conserva, et al., 2001
Palmeira, S.F., Jr.; Conserva, L.M.; Andrade, E.H.A.; Guilhon, G.M.S.P., Analysis by GC-MS of the hexane extract of the aerial parts of Aristolochia acutifolia Duchtr., Flavour Fragr. J., 2001, 16, 2, 85-88, https://doi.org/10.1002/1099-1026(200103/04)16:2<85::AID-FFJ948>3.0.CO;2-2 . [all data]

Palá-Paúl, Pérez-Alonso, et al., 2001
Palá-Paúl, J.; Pérez-Alonso, M.J.; Velasco-Negueruela, A.; Palá-Paúl, R.; Sanz, J.; Conejero, Fco., Seasonal variation in chemical constituents of Santolina rosmarinifolia L. ssp. rosmarinifolia, Biochem. Syst. Ecol., 2001, 29, 7, 663-672, https://doi.org/10.1016/S0305-1978(01)00032-1 . [all data]

Rousis, Papadogianni, et al., 2001
Rousis, V.; Papadogianni, K.; Vagias, C.; Harvala, C.; Petrakis, P.V.; Ortiz, A., Volatile constituents of three Pinus species grown in Greece, J. Essent. Oil Res., 2001, 13, 2, 118-121, https://doi.org/10.1080/10412905.2001.9699632 . [all data]

Santos-Gomes and Fernandes-Ferreira, 2001
Santos-Gomes, P.C.; Fernandes-Ferreira, M., Organ- and season-dependent variation in the essential oil composition of Salvia officinalis L. cultivated at two different sites, J. Agric. Food Chem., 2001, 49, 6, 2908-2916, https://doi.org/10.1021/jf001102b . [all data]

Sayyah, Kamalinejad, et al., 2001
Sayyah, M.; Kamalinejad, M.; Hidage, R.B.; Rustaiyan, A., Antiepileptic potential and composition of the fruit essential oil of Ferula Gummosa boiss., 2001, retrieved from http://ibj.pasteur.ac.ir/ibj11/sayyah.htm. [all data]

Sayyah, Kamalinejad, et al., 2001, 2
Sayyah, M.; Kamalinejad, M.; Hidage, R.B.; Rustaiyan, A., Antiepileptic potential and composition of the fruit essential oil of Ferula Gummosa boiss, Iranian Biomed J., 2001, 5, 2-3, 69-72. [all data]

Tellez M., Estell R., et al., 2001
Tellez M.; Estell R.; Fredrickson E.; Powell J.; Wedge D.; Schrader K.; Kobaisy M., Extracts of Flourensia cernua (L): Volatile constituents and antifungal, antialgal, and antitermite bioactivities, J. Chem. Ecol., 2001, 27, 11, 2263-2273, https://doi.org/10.1023/A:1012283005014 . [all data]

Yang, 2001
Yang, R., Analysis of the volatile components in peel oil of Yuzu by gas chromatography/mass spectrometry, Chin. J. Anal. Chem., 2001, 29, 3, 313-316. [all data]

Yang, 2001, 2
Yang, R., Volatile compounds in peel oil of Citrus sudachi, Food Sci. (Beijing), 2001, 22, 3, 71-73. [all data]

Bailac, Dellacasa, et al., 2000
Bailac, P.N.; Dellacasa, A.D.; Bernasconi, H.O.; Firpo, N.H.; Ponzi, M.I., Composicion del aceite esencial y actividad antimicrobiana de eupatorium patens, Bol. Soc. Chil. Quim., 2000, 45, 207-211. [all data]

Bicalho, Pereira, et al., 2000
Bicalho, B.; Pereira, A.S.; Aquino Neto, F.R.; Pinto, A.C.; Rezende, C.M., Application of high-temperature gas chromatography-mass spectrometry to the investigation of glycosidically bound components related to cashew applie (Anacardium occidentale L. Var. nanum) volatiles, J. Agric. Food Chem., 2000, 48, 4, 1167-1174, https://doi.org/10.1021/jf9909252 . [all data]

Hedin, McKibben, et al., 2000
Hedin, P.A.; McKibben, G.H.; Dollar, D.A., Role of ground trash volatiles in the selection of hibernation sites by boll weevils, J. Agric. Food Chem., 2000, 48, 8, 3673-3676, https://doi.org/10.1021/jf991001h . [all data]

Jirovetz, Puschmann, et al., 2000
Jirovetz, L.; Puschmann, C.; Stojanova, A.; Metodiev, S.; Buchbauer, G., Analysis of the essential oil volatiles of Douglas fir (Pseudotsuga menziesii) from Bulgaria, Flavour Fragr. J., 2000, 15, 6, 434-437, https://doi.org/10.1002/1099-1026(200011/12)15:6<434::AID-FFJ935>3.0.CO;2-0 . [all data]

Mallavarapu, Rao, et al., 2000
Mallavarapu, G.R.; Rao, L.; Ramesh, S., Volatile constituents of the leaf and fruit oils of Murraya koenigii Spreng., L. Ess. Oil Res., 2000, 12, 6, 766-768, https://doi.org/10.1080/10412905.2000.9712211 . [all data]

Meccia, Rojas, et al., 2000
Meccia, G.; Rojas, L.B.; Rosquete, C.; Feliciano, A.S., Essential oil of Croton ovalifolius Vahl from Venezuela, Flavour Fragr. J., 2000, 15, 3, 144-146, https://doi.org/10.1002/1099-1026(200005/06)15:3<144::AID-FFJ882>3.0.CO;2-C . [all data]

Novak, Novak, et al., 2000
Novak, J.; Novak, S.; Bitsch, C.; Franz, C.M., Essential oil composition of underground parts of Valeriana celtica ssp. from Austria and Italy, Flavour Fragr. J., 2000, 15, 1, 40-42, https://doi.org/10.1002/(SICI)1099-1026(200001/02)15:1<40::AID-FFJ863>3.0.CO;2-B . [all data]

Tamura, Boonbumrung, et al., 2000
Tamura, H.; Boonbumrung, S.; Yoshizawa, T.; Varanyanond, W., Volatile components of the essential oil in the pulp of four yellow mangoes (Mangifera indica L.) in Thailand, Food Sci. Technol. Res., 2000, 6, 1, 68-73, https://doi.org/10.3136/fstr.6.68 . [all data]

Tellez, Dayan, et al., 2000
Tellez, M.R.; Dayan, F.E.; Schrader, K.K.; Wedge, D.E.; Duke, S.O., Composition and some biological activities of the essential oils of Callicarpa Americana (L.), J. Agric. Food Chem., 2000, 48, 7, 3008-3012, https://doi.org/10.1021/jf991026g . [all data]

Asekun and Ekundayo, 1999
Asekun, O.T.; Ekundayo, O., Constituents of the leaf essential oil of Cedrela odorata L. from Nigeria, Flavour Fragr. J., 1999, 14, 6, 390-392, https://doi.org/10.1002/(SICI)1099-1026(199911/12)14:6<390::AID-FFJ850>3.0.CO;2-3 . [all data]

Ayedoun, Adéoti, et al., 1999
Ayedoun, M.A.; Adéoti, B.S.; Setondji, J.; Tchoumbougnang, F.; Kuiaté, J.R.; Zollo, P.H.A.; Menut, C.; Lamaty, G.; Bessière, J.M., Aromatic plants of tropical West Africa. XII. Essential oil of Hoslundia opposita Vahl. growing in Benin and Cameroon, Flavour Fragr. J., 1999, 14, 5, 319-321, https://doi.org/10.1002/(SICI)1099-1026(199909/10)14:5<319::AID-FFJ836>3.0.CO;2-O . [all data]

Dzumayev, Tkachenko, et al., 1999
Dzumayev, Kh.K.; Tkachenko, K.G.; Tsibulskaya, I.A., Essential Oils of Origanum tytthanthum Gontsch. Produced from Plants Grown in Southern Uzbekistan, J. Essent. Oil Res., 1999, 11, 11, 593-598, https://doi.org/10.1080/10412905.1999.9701220 . [all data]

Kalemba, 1999
Kalemba, D., Constituents of the essential oil of Artemisia asiatica Nakai, Flavour Fragr. J., 1999, 14, 3, 173-176, https://doi.org/10.1002/(SICI)1099-1026(199905/06)14:3<173::AID-FFJ805>3.0.CO;2-Q . [all data]

Khalilov L.M., Khalilova A.Z., et al., 1999
Khalilov L.M.; Khalilova A.Z.; Odinokov V.N.; Baltaev U.A.; Paramonov E.A.; Dzhemilev U.M., Identification and biological activity of the volatile organic substances emitted by plants and insects - II. Sesquiterpene composition of the native scent of leaves of the potato Solanum tuberosum, Chem. Nat. Compd. (Engl. Transl.), 1999, 35, 4, 422-426, https://doi.org/10.1007/BF02282508 . [all data]

Koulman, 1999
Koulman, A., Podophyllotoxin: a study of biosynthesis, evolution, function, and use of podophyllotoxin and related lignans, University Library Groningen, Nederlands, 1999, 188, retrieved from http://www.ub.rug.nl/eldoc/dis/science/a.koulman/. [all data]

Kuiate, Zollo, et al., 1999
Kuiate, J.-R.; Zollo, P.-H.A.; Nguefa, E.H.; Bessière, J.-M.; Lamaty, G.; Menut, C., Composition of the essential oils from the leaves of Microglossa pyrifolia (Lam.) O. Kuntze and Helichrysum odoratissimum (L.) Less. growing in Cameroon, Flavour Fragr. J., 1999, 14, 2, 82-84, https://doi.org/10.1002/(SICI)1099-1026(199903/04)14:2<82::AID-FFJ780>3.0.CO;2-Z . [all data]

Labuckas, Zygadlo, et al., 1999
Labuckas, D.O.; Zygadlo, J.A.; Faillaci, S.M.; Espinar, L.A., Constituents of the volatile oil of Porophyllum obscurum (Spreng.) D.C., Flavour Fragr. J., 1999, 14, 2, 107-108, https://doi.org/10.1002/(SICI)1099-1026(199903/04)14:2<107::AID-FFJ799>3.0.CO;2-E . [all data]

Lopes, Koketsu, et al., 1999
Lopes, D.; Koketsu, M.; Carauta, J.P.P.; de Oliveira, R.R.; Kaplan, M.A.C., Chemical composition of Pourouma guianensis Aublet essential oils, Flavour Fragr. J., 1999, 14, 4, 233-236, https://doi.org/10.1002/(SICI)1099-1026(199907/08)14:4<233::AID-FFJ813>3.0.CO;2-L . [all data]

Mallavarapu, Kulkarni, et al., 1999
Mallavarapu, G.R.; Kulkarni, R.N.; Baskaran, K.; Rao, L.; Ramesh, S., Influence of plant growth stage on the essential oil content and composition in Davana (Artemisia pallens Wall.), J. Agric. Food Chem., 1999, 47, 1, 254-258, https://doi.org/10.1021/jf980624c . [all data]

Oberhofer, Nikiforov, et al., 1999
Oberhofer, B.; Nikiforov, A.; Buchbauer, G.; Jirovetz, L.; Bicchi, C., Investigation of the alteration of the composition of various essential oils used in aroma lamp applications, Flavour Fragr. J., 1999, 14, 5, 293-299, https://doi.org/10.1002/(SICI)1099-1026(199909/10)14:5<293::AID-FFJ829>3.0.CO;2-T . [all data]

Oyedeji, Olawore, et al., 1999
Oyedeji, A.O.; Olawore, O.N.; Ekundayo, O.; Koenig, W.A., Volatile leaf oil constituents of three Eucalyptus species from Nigeria, Flavour Fragr. J., 1999, 14, 4, 241-244, https://doi.org/10.1002/(SICI)1099-1026(199907/08)14:4<241::AID-FFJ820>3.0.CO;2-Y . [all data]

Palá-Paúl, Pérez-Alonso, et al., 1999
Palá-Paúl, J.; Pérez-Alonso, M.J.; Velasco-Negueruela, A.; Ramos-Vázquez, P.; Gómez-Contreras, F.; Sanz, J., Essential oil of Santolina rosmarinifolia L. ssp. rosmarinifolia: first isolation of capillene, a diacetylene derivative, Flavour Fragr. J., 1999, 14, 2, 131-134, https://doi.org/10.1002/(SICI)1099-1026(199903/04)14:2<131::AID-FFJ794>3.0.CO;2-7 . [all data]

Prikhod'ko, Klyuev, et al., 1999
Prikhod'ko, A.B.; Klyuev, N.A.; Volkovich, S.V.; Emets, T.I.; Petrenko, V.V.; Dolya, E.V., Component composition od the essential oil of Thymus dimorphus, Chem. Nat. Comp., 1999, 35, 1, 46-51, https://doi.org/10.1007/BF02238208 . [all data]

Rustaiyan, Masoudi, et al., 1999
Rustaiyan, A.; Masoudi, S.; Monfared, A.; Komeilizadeh, H., Volatile constituents of three Salvia species grown wild in Iran, Flavour Fragr. J., 1999, 14, 5, 276-278, https://doi.org/10.1002/(SICI)1099-1026(199909/10)14:5<276::AID-FFJ825>3.0.CO;2-Y . [all data]

Sefidkon, Dabiri, et al., 1999
Sefidkon, F.; Dabiri, M.; Rahimi-Bidgoly, A., The effect of distillation methods and stage of plant growth on the essential oil content and composition of Thymus kotschyanus Boiss. Hohen, Flavour Fragr. J., 1999, 14, 6, 405-408, https://doi.org/10.1002/(SICI)1099-1026(199911/12)14:6<405::AID-FFJ853>3.0.CO;2-M . [all data]

Sefidkon and Khajavi, 1999
Sefidkon, F.; Khajavi, M.S., Chemical composition of the essential oils of two Salvia species from Iran: Salvia verticillata L. and Salvia santolinifolia Boiss., Flavour Fragr. J., 1999, 14, 2, 77-78, https://doi.org/10.1002/(SICI)1099-1026(199903/04)14:2<77::AID-FFJ726>3.0.CO;2-9 . [all data]

Sefidkon and Mirza, 1999
Sefidkon, F.; Mirza, M., Chemical composition of the essential oils of two Salvia species from Iran, Salvia virgata Jacq. and Salvia syriaca L., Flavour Fragr. J., 1999, 14, 1, 45-46, https://doi.org/10.1002/(SICI)1099-1026(199901/02)14:1<45::AID-FFJ774>3.0.CO;2-S . [all data]

Tellez, Canel, et al., 1999
Tellez, M.R.; Canel, C.; Rimando, A.M.; Duke, S.O., Differential accumulation of isoprenoids in glanded and glandless Artemisia annua L, Phytochemistry, 1999, 52, 6, 1035-1040, https://doi.org/10.1016/S0031-9422(99)00308-8 . [all data]

Camciuc, Bessière, et al., 1998
Camciuc, M.; Bessière, J.M.; Vilarem, G.; Gaset, A., Volatile components in okra seed coat, Phytochemistry, 1998, 48, 2, 311-315, https://doi.org/10.1016/S0031-9422(97)01127-8 . [all data]

Doneanu and Anitescu, 1998
Doneanu, C.; Anitescu, G., Supercritical carbon dioxide extraction of Angelica archangelica L. root oil, J. Supercrit. Fluids, 1998, 12, 1, 59-67, https://doi.org/10.1016/S0896-8446(97)00040-5 . [all data]

El-Sakhawy, El-Tantawy, et al., 1998
El-Sakhawy, F.S.; El-Tantawy, M.E.; Ross, S.A.; El-Sohly, M.A., Composition and antimicrobial activity of the essential oil of Murraya exotica L., Flavour Fragr. J., 1998, 13, 1, 59-62, https://doi.org/10.1002/(SICI)1099-1026(199801/02)13:1<59::AID-FFJ693>3.0.CO;2-L . [all data]

Jantan, Ahmad, et al., 1998
Jantan, I.; Ahmad, A.S.; Bakar, S.A.A.; Ahmad, A.R.; Trockenbrodt, M.; Chak, C.V., Constituents of the essential oil of Baeckea frutescens L. from Malaysia, Flavour Fragr. J., 1998, 13, 4, 245-247, https://doi.org/10.1002/(SICI)1099-1026(1998070)13:4<245::AID-FFJ736>3.0.CO;2-J . [all data]

Kökdil, Kurucu, et al., 1998
Kökdil, G.; Kurucu, S.; Yildiz, A., Essential oil composition of Nepeta nuda L. ssp. nuda, Flavour Fragr. J., 1998, 13, 4, 233-234, https://doi.org/10.1002/(SICI)1099-1026(1998070)13:4<233::AID-FFJ730>3.0.CO;2-7 . [all data]

Maia, Zohhbi, et al., 1998
Maia, J.G.S.; Zohhbi, M.G.B.; Andrade, E.H.A.; Santos, A.S.; da Silva, M.H.L.; Luz, A.I.R.; Bastos, C.N., Constituents of the essential oil of Piper aduncum L. growing wild in the Amazon region, Flavour Fragr. J., 1998, 13, 4, 269-272, https://doi.org/10.1002/(SICI)1099-1026(1998070)13:4<269::AID-FFJ744>3.0.CO;2-A . [all data]

Milso, Mastelic, et al., 1998
Milso, M.; Mastelic, J.; Radonic, A., Free and glycosidically bound volatile compounds from cypress cones (Cupressus Sempervirens L.), Croat. Chem. Acta, 1998, 71, 1, 139-145. [all data]

Poiana, Sicari, et al., 1998
Poiana, M.; Sicari, V.; Mincione, B., Supercritical carbon dioxide (SC-CO2) extraction of grapefruit flavedo, Flavour Fragr. J., 1998, 13, 2, 125-130, https://doi.org/10.1002/(SICI)1099-1026(199803/04)13:2<125::AID-FFJ708>3.0.CO;2-# . [all data]

Stashenko, Cervantes, et al., 1998
Stashenko, E.E.; Cervantes, M.; Combariza, Y.; Martínez, J.R., HRGC-FID-MSD Analysis of the Secondary Metabolites Obtained by Different Extraction Methods from Lepechinia schiedeana, and Evaluation of its Antioxidant Activity in vitro in 20th International Symposium on Capillary Chromatography, 1998, 1-11. [all data]

Zollo, Biyiti, et al., 1998
Zollo, P.H.A.; Biyiti, L.; Tchoumbougnang, F.; Menut, C.; Lamaty, G.; Bouchet, Ph., Aromatic plants of tropical central Africa. Part XXXII. Chemical composition and antifungal activity of thirteen essential oils from aromatic plants of Cameroon, Flavour Fragr. J., 1998, 13, 2, 107-114, https://doi.org/10.1002/(SICI)1099-1026(199803/04)13:2<107::AID-FFJ701>3.0.CO;2-G . [all data]

Bos, Woerdenbag, et al., 1997
Bos, R.; Woerdenbag, H.J.; Hendriks, H.; Smit, H.F.; Wikström, H.V.; Scheffer, J.J.C., Composition of the essential oil from roots and rhizomes of Valeriana wallichii DC, Flavour Fragr. J., 1997, 12, 2, 123-131, https://doi.org/10.1002/(SICI)1099-1026(199703)12:2<123::AID-FFJ613>3.0.CO;2-4 . [all data]

Bos, Woerdenbag, et al., 1997, 2
Bos, R.; Woerdenbag, H.J.; Hendriks, H.; Scheffer, J.J.C., Composition of the essential oils from underground parts of Valeriana officinalis L. s.l. and several closely related taxa, Flavour Fragr. J., 1997, 12, 5, 359-370, https://doi.org/10.1002/(SICI)1099-1026(199709/10)12:5<359::AID-FFJ660>3.0.CO;2-G . [all data]

Elias, Simoneit, et al., 1997
Elias, V.O.; Simoneit, B.R.T.; Cardoso, J.N., Analysis of volatile sesquiterpenoids in environmental and geological samples, J. Hi. Res. Chromatogr., 1997, 20, 6, 305-309, https://doi.org/10.1002/jhrc.1240200602 . [all data]

Kökdil, Kurucu, et al., 1997
Kökdil, G.; Kurucu, S.; Topcu, G., Chemical constituents of the essential oils of Nepeta italica L. and Nepeta sulfuriflora P. H. Davis, Flavour Fragr. J., 1997, 12, 1, 33-35, https://doi.org/10.1002/(SICI)1099-1026(199701)12:1<33::AID-FFJ609>3.0.CO;2-V . [all data]

Kökdil, Tanker, et al., 1997
Kökdil, G.; Tanker, M.; Kurucu, S.; Topcu, G., Essential oil analysis of Nepeta cilicia Boiss., Flavour Fragr. J., 1997, 12, 2, 99-101, https://doi.org/10.1002/(SICI)1099-1026(199703)12:2<99::AID-FFJ619>3.0.CO;2-# . [all data]

Salgueiro, Vila, et al., 1997
Salgueiro, L.R.; Vila, R.; Tomi, F.; Figueiredo, A.C.; Barroso, J.G.; Cañigueral, S.; Casanova, J.; da Cunha, A.P.; Adzet, T., Variability of essential oils of Thymus caespititius from Portugal, Phytochemistry, 1997, 45, 2, 307-311, https://doi.org/10.1016/S0031-9422(96)00872-2 . [all data]

Tellez, Estell, et al., 1997
Tellez, M.R.; Estell, R.E.; Frederickson, E.L.; Havstad, K.M., Essntial oil of Flourensia cernua DC, J. Essent. Oil Res., 1997, 9, 6, 619-624, https://doi.org/10.1080/10412905.1997.9700799 . [all data]

Zunino, Novillo-Newton, et al., 1997
Zunino, M.P.; Novillo-Newton, M.; Maestri, D.M.; Zygadlo, J.A., Composition of the essential oil of Baccharis crispa Spreng. and Baccharis salicifolia Pers. grown in Cordoba (Argentina), Flavour Fragr. J., 1997, 12, 6, 405-407, https://doi.org/10.1002/(SICI)1099-1026(199711/12)12:6<405::AID-FFJ667>3.0.CO;2-R . [all data]

Zygadlo, Ariza-Espinar, et al., 1997
Zygadlo, J.A.; Ariza-Espinar, L.; Velasco-Negueruela, A.; Perez-Alonso, M.J., Volatile constituents of Stevia achalensis hieronymus, Flavour Fragr. J., 1997, 12, 4, 297-299, https://doi.org/10.1002/(SICI)1099-1026(199707)12:4<297::AID-FFJ625>3.0.CO;2-2 . [all data]

Ayedoun, Adeoti, et al., 1996
Ayedoun, A.M.; Adeoti, B.S.; Sossou, P.V.; Leclerq, P.A., Influence of fruit conservation methods on the essential oil composition of xylopia aethiopica (Dunal) A. Richard from Benin, Flavour Fragr. J., 1996, 11, 4, 245-250, https://doi.org/10.1002/(SICI)1099-1026(199607)11:4<245::AID-FFJ583>3.0.CO;2-K . [all data]

Chacko, Jayalekshmy, et al., 1996
Chacko, S.; Jayalekshmy, A.; Gopalakrishnan, M.; Narayanan, C.S., Roasting studies on black pepper (Piper nigrum L.), Flavour Fragr. J., 1996, 11, 5, 305-310, https://doi.org/10.1002/(SICI)1099-1026(199609)11:5<305::AID-FFJ588>3.0.CO;2-1 . [all data]

Orav, Kailas, et al., 1996
Orav, A.; Kailas, T.; Liiv, M., Analysis of terpenoic composition of conifer needle oils by steam distillation/extraction, gas chromatography and gas chromatography-mass spectrometry, Chromatographia, 1996, 43, 3/4, 215-219, https://doi.org/10.1007/BF02292955 . [all data]

Sagrero-Nieves and Bartley, 1996
Sagrero-Nieves, L.; Bartley, J.P., Volatile components from the leaves of heterotheca inuloides Cass., Flavour Fragr. J., 1996, 11, 1, 49-51, https://doi.org/10.1002/(SICI)1099-1026(199601)11:1<49::AID-FFJ538>3.0.CO;2-J . [all data]

Stashenko, Puertas, et al., 1996
Stashenko, E.E.; Puertas, M.A.; Combariza, M.Y., Volatile secondary metabolites from Spilanthes americana obtained by simultaneous steam distillation--solvent extraction and supercritical fluid extraction, J. Chromatogr. A, 1996, 752, 1-2, 223-232, https://doi.org/10.1016/S0021-9673(96)00480-3 . [all data]

Thanh, Dung, et al., 1996
Thanh, L.; Dung, N.X.; Bighetti, A.; Casanova, J.; Leclercq, P.A., Combination of cCapillary GC, GC/MS and 13C-NMR for the Characterization of the Rhizome Oil of Piper betle L. (Piperaceae) from Vietnam, Spectroscopy, 1996, 13, 2, 131-136, https://doi.org/10.1155/1997/397354 . [all data]

Wong and Lai, 1996
Wong, K.C.; Lai, F.Y., Volatile constituents from the fruits of four Syzygium species grown in Malaysia, Flavour Fragr. J., 1996, 11, 1, 61-66, https://doi.org/10.1002/(SICI)1099-1026(199601)11:1<61::AID-FFJ539>3.0.CO;2-1 . [all data]

Nishimura, 1995
Nishimura, O., Application of a thermal desorption cold trap injector to multidimensional GC and GC-MS, J. Hi. Res. Chromatogr., 1995, 18, 11, 699-704, https://doi.org/10.1002/jhrc.1240181105 . [all data]

Stashenko, Torres, et al., 1995
Stashenko, E.E.; Torres, W.; Morales, J.R.M., A study of the compositional variation of the essential oil of ylang-ylang (Cananga odorata Hook Fil. et Thomson, forma genuina) during flower development, J. Hi. Res. Chromatogr., 1995, 18, 2, 101-104, https://doi.org/10.1002/jhrc.1240180206 . [all data]

Tirado, Stashenko, et al., 1995
Tirado, C.B.; Stashenko, E.E.; Combariza, M.Y.; Martinez, J.R., Comparative study of Colombian citrus oils by high-resolution gas chromatography and gas chromatography-mass spectrometry, J. Chromatogr. A, 1995, 697, 1-2, 501-513, https://doi.org/10.1016/0021-9673(94)00955-9 . [all data]

Ramanoelina, Viano, et al., 1994
Ramanoelina, P.A.R.; Viano, J.; Bianchini, J.-P.; Gaydou, E.M., Occurrence of various chemotypes in Niaouli (Melaleuca quinquenervia) essential oils from Madagascar using multivariate statistical analysis, J. Agric. Food Chem., 1994, 42, 5, 1177-1182, https://doi.org/10.1021/jf00041a024 . [all data]

Demarne and van der Walt, 1993
Demarne, F.-E.; van der Walt, J.J.A., Composition of the Essential Oil of Pelargonium citronellum (Geraniaceae), J. Essent. Oil Res., 1993, 5, 3, 233-238, https://doi.org/10.1080/10412905.1993.9698214 . [all data]

Gopalakrishnan, Menon, et al., 1993
Gopalakrishnan, M.; Menon, N.; Padmakumari, K.P.; Jayalekshmy, A.; Narayanan, C.S., GC Analysis and Odor Profiles of Four New Indian Genotypes of Piper nigrum L., J. Essent. Oil Res., 1993, 5, 3, 247-253, https://doi.org/10.1080/10412905.1993.9698217 . [all data]

Kaul, Singh, et al., 1993
Kaul, V.K.; Singh, B.; Sood, R.P., Volatile Constituents of the Essential Oil of Tanacetum longifolium Wall., J. Essent. Oil Res., 1993, 5, 6, 597-601, https://doi.org/10.1080/10412905.1993.9698290 . [all data]

Shiota, 1993
Shiota, H., New esteric components in the volatiles of banana fruit (Musa sapientum L.), J. Agric. Food Chem., 1993, 41, 11, 2056-2062, https://doi.org/10.1021/jf00035a046 . [all data]

Kollmannsberger, Nitz, et al., 1992
Kollmannsberger, H.; Nitz, S.; Drawert, F., UBer die Aromastoffzusammensetzung von Hochdruckextrakten. I. Pfeffer (Piper nigrum, Var. muntok), Z. Lebensm. Unters Forsch., 1992, 194, 6, 545-551, https://doi.org/10.1007/BF01185481 . [all data]

Velasco-Negueruela, Pérez Alonso, et al., 1991
Velasco-Negueruela, A.; Pérez Alonso, M.J.; Burzaco, A., Aceites esenciales de tomillos ibéricos. VI. Contribución al conocimiento del aceite esencial de thymus capitellatus Hoffmanns. Link, Anales Jard. Bot. Madrid, 1991, 49, 1, 77-81. [all data]

Binder, Benson, et al., 1990
Binder, R.G.; Benson, M.E.; Flath, R.A., Volatile Components of Safflower, J. Agric. Food Chem., 1990, 38, 5, 1245-1248, https://doi.org/10.1021/jf00095a020 . [all data]

Binder, Turner, et al., 1990
Binder, R.G.; Turner, C.E.; Flath, R.A., Comparison of yellow starthistle volatiles from different plant parts, J. Agric. Food Chem., 1990, 38, 3, 764-767, https://doi.org/10.1021/jf00093a038 . [all data]

Jantan and Goh, 1990
Jantan, I.; Goh, S.H., The essential oils of Cinnamomum mollissimum as natural sources of safrole and benzyl benzoate, J. Tropical Forest Sci., 1990, 2, 3, 252-259. [all data]

Ronse and De Pooter, 1990
Ronse, A.C.; De Pooter, H.L., Essential Oil Production by Belgian Artemisia alba (Turra) before and after Micropropagation, J. Essent. Oil Res., 1990, 2, 5, 237-242, https://doi.org/10.1080/10412905.1990.9697873 . [all data]

Wyllie, Brophy, et al., 1990
Wyllie, S.G.; Brophy, J.J.; Sarafis, V.; Hobbs, M., Volatile Components of the Fruit of Pistacia Lentiscus, J. Food. Sci., 1990, 55, 5, 1325-1326, https://doi.org/10.1111/j.1365-2621.1990.tb03926.x . [all data]

Yang and Sugisawa, 1990
Yang, R.; Sugisawa, H., Citrus Suachi Hort. ex Shirai. Volatile components in Sudachi (Citrus Sudachi Hort. ex Shirai) juice, Nippon Shokuhin Kogyo Gakkaishi, 1990, 37, 12, 946-952, https://doi.org/10.3136/nskkk1962.37.12_946 . [all data]

Binder and Flath, 1989
Binder, R.G.; Flath, R.A., Volatile components of pineapple guava, J. Agric. Food Chem., 1989, 37, 3, 734-736, https://doi.org/10.1021/jf00087a034 . [all data]

Brophy, Davies, et al., 1989
Brophy, J.J.; Davies, N.W.; Southwell, I.A.; Stiff, I.A.; Williams, L.R., Gas chromatographic quality control for oil of Melaleuca terpinen-4-ol type (Australian tea tree), J. Agric. Food Chem., 1989, 37, 5, 1330-1335, https://doi.org/10.1021/jf00089a027 . [all data]

de Pooter, de Buyck, et al., 1989
de Pooter, H.L.; de Buyck, L.F.; Schamp, N.M.; Billiet, F.; De Bruyn, A., The volatile fraction of Otacanthus coeruleus Lindl. Containing the new copaene derivative β-copaen-4α-ol, Flavour Fragr. J., 1989, 4, 2, 47-51, https://doi.org/10.1002/ffj.2730040202 . [all data]

Sugisawa, Yamamoto, et al., 1989
Sugisawa, H.; Yamamoto, M.; Tamura, H.; Takagi, N., The comparison of volatile components in peel oil from four species of navel orange, Nippon Shokuhin Kogio Gakkaishi, 1989, 36, 6, 455-462, https://doi.org/10.3136/nskkk1962.36.6_455 . [all data]

Sugisawa, Yang, et al., 1989
Sugisawa, H.; Yang, R.H.; Kawabata, C.; Tamura, H., Volatile constituents in the peel oil of sudachi (Citrus sudachi), Agric. Biol. Chem., 1989, 53, 6, 1721-1723, https://doi.org/10.1271/bbb1961.53.1721 . [all data]

Takeoka and Butter, 1989
Takeoka, G.; Butter, R.G., Volatile constituents of pineapple (Ananas Comosus [L.] Merr.) in Flavor Chemistry. Trends and Developments, Teranishi,R.; Buttery,R.G.; Shahidi,F., ed(s)., American Chemical Society, Washington, DC, 1989, 223-237. [all data]

Bestmann, Classen, et al., 1988
Bestmann, H.-J.; Classen, B.; Kobold, U.; Vostrowsky, O.; Klingauf, F.; Stein, U., Steam volatile constituents from leaves of Rhus typhina, Phytochemistry, 1988, 27, 1, 85-90, https://doi.org/10.1016/0031-9422(88)80595-8 . [all data]

de Pooter, Nicolai, et al., 1988
de Pooter, H.L.; Nicolai, B.; De Laet, J.; De Buyck, L.F.; Schamp, N.M.; Goetghebeur, P., The Essential Oils of Five Nepeta Species. A Preliminary Evaluation of their Use in Chemotaxonomy by Cluster Analysis, Flavour Fragr. J., 1988, 3, 4, 155-159, https://doi.org/10.1002/ffj.2730030404 . [all data]

Ramaswami, Briscese, et al., 1988
Ramaswami, S.K.; Briscese, P.; Gargiullo, R.J.; von Geldern, T., Sesquiterpene hydrocarbons: from mass confusion to orderly line-up in Flavors and Fragrances: A World Perspective. Proceedings of the 10th International Congress of Essential Oils, Fragrances and Flavors, Lawrence,B.M.; Mookherjee,B.D.; Willis,B.J., ed(s)., Elsevier, New York, 1988, 951-980. [all data]

Nykanen, 1986
Nykanen, I., High Resolution Gas Chromatographic - Mass Spectrometric determination of the Flavour Composition of Wild Majoram (Origanum vulgare L.) Cultivated in Finland, Z. Lebensm Unters Forsch, 1986, 183, 4, 267-272, https://doi.org/10.1007/BF01087742 . [all data]

Perry, Baxter, et al., 1986
Perry, N.B.; Baxter, A.J.; Brennan, N.J.; van Klink, J.W., Dalmatian Sage. PArt 1. Differing oil yields and compositions from flowering and non-flowering accessions, Flavour Fragr. J., 1986, 11, 4, 231-238, https://doi.org/10.1002/(SICI)1099-1026(199607)11:4<231::AID-FFJ572>3.0.CO;2-0 . [all data]

de Pooter, de Buyck, et al., 1986
de Pooter, H.L.; de Buyck, L.F.; Schamp, N.M.; Aboutabl, E.; De Bruyn, A.; Husain, S.Z., The Volatile Fraction of Senecio glaucus subsp. coronopifolius, Flavour Fragr. J., 1986, 1, 4-5, 159-163, https://doi.org/10.1002/ffj.2730010406 . [all data]

De Pooter and Schamp, 1986
De Pooter, H.L.; Schamp, N.M., Comparison of the Volatile Composition of Some Calamintha/Satureja Species, Prog. Essnt. Oil. Res., 1986, 139-150. [all data]

Ramaswami, Briscese, et al., 1986
Ramaswami, S.K.; Briscese, P.; Gargiullo, R.J.; von Geldern, T., Sesquiterpene hydrocarbons: from mass confusion to orderly line-up in Flavors and Fragrances: A World Perspective, Lawrence,B.M.; Mookherjee,B.D.; Willis,B.J., ed(s)., Proceedings of the 10th International Congress of Essential Oils, Fragrances, and Flavors, Washington, DC, 1986, 951-959. [all data]

Buttery, Xu, et al., 1985
Buttery, R.G.; Xu, C.; Ling, L.C., Volatile components of wheat leaves (and stems): Possible insect attractants, J. Agric. Food Chem., 1985, 33, 1, 115-117, https://doi.org/10.1021/jf00061a033 . [all data]

Shibamoto and Jennings, 1977
Shibamoto, T.; Jennings, W.G., The volatile composition of the leaf oil of California Juniper (J. californica Carr.) in Proceedings of VII International Congress of Essential Oils, October 7-11, 1977, Kyoto, Japan, 1977, 413-418. [all data]