1-[(4-Nitrophenyl)ethynyl]-4-ethoxybenzene

Phase change data

Data compiled by: William E. Acree, Jr., James S. Chickos

Enthalpy of fusion

ΔfusH (kJ/mol) Temperature (K) Method Reference
26.02388.1DSCSpadlo, Dziaduszek, et al., 2002

References

Spadlo, Dziaduszek, et al., 2002
Spadlo, A.; Dziaduszek, Jerzy; Dabrowski, Roman S.; Czuprynski, Krzysztof L.; Stolarz, Zofia; Wu, Shin-Tson, Synthesis and mesomorphic properties of isothiocyanatotolanes, 2002, 79-84, https://doi.org/10.1117/12.472126 . [all data]