3,3,4,5,6,6-Hexafluoro-3,6-dihydro-2-trifluoromethyl-2H-1,2-oxazine

Phase change data

Data compiled by: William E. Acree, Jr., James S. Chickos

Enthalpy of vaporization

ΔvapH (kJ/mol) Temperature (K) Method Reference Comment
31.4278.AStephenson and Malanowski, 1987Based on data from 263. - 323. K. See also Banks, Barlow, et al., 1965.

References

Stephenson and Malanowski, 1987
Stephenson, Richard M.; Malanowski, Stanislaw, Handbook of the Thermodynamics of Organic Compounds, 1987, https://doi.org/10.1007/978-94-009-3173-2 . [all data]

Banks, Barlow, et al., 1965
Banks, R.E.; Barlow, M.G.; Haszeldine, R.N., 1146. Perfluoroalkyl derivatives of nitrogen. Part XVIII. Reaction of trifluoronitrosomethane with perfluorobutadiene and 3,4-dichloro-hexafluorobut-1-ene, J. Chem. Soc., 1965, 6149, https://doi.org/10.1039/jr9650006149 . [all data]