7H-Furo[3,2-g][1]benzopyran-7-one, 4-[(3-methyl-2-butenyl)oxy]-

Normal alkane RI, non-polar column, temperature ramp

Data compiled by: NIST Mass Spectrometry Data Center, William E. Wallace, director

Column type Capillary
Active phase DB-5
Column length (m) 15.
Carrier gas He
Substrate
Column diameter (mm) 0.25
Phase thickness (μm) 0.5
Tstart (C) 50.
Tend (C) 320.
Heat rate (K/min) 10.
Initial hold (min) 1.
Final hold (min) 5.
I 2394.
ReferenceFeger, Brandauer, et al., 2006
Comment MSDC-RI

References

Feger, Brandauer, et al., 2006
Feger, W.; Brandauer, H.; Gabris, P.; Ziegler, H., Nonvolatiles of Commercial Lime and Grapefruit Oils Separated by High-Speed Countercurrent Chromatography, J. Agric. Food Chem., 2006, 54, 6, 2242-2252, https://doi.org/10.1021/jf052267t . [all data]