Tris(di-n-butyldithiocarbamato)arsenic(III)

Condensed phase thermochemistry data

Data compiled by: Eugene S. Domalski and Elizabeth D. Hearing

Constant pressure heat capacity of solid

Cp,solid (J/mol*K) Temperature (K) Reference Comment
861.298.15Airoldi and De Souza, 1989T = 385 to 395 K.

Phase change data

Data compiled as indicated in comments:
AC - William E. Acree, Jr., James S. Chickos
DH - Eugene S. Domalski and Elizabeth D. Hearing

Quantity Value Units Method Reference Comment
Δsub128. ± 3.kJ/molN/ALiebman, Simões, et al., 1994AC

Enthalpy of fusion

ΔfusH (kJ/mol) Temperature (K) Reference Comment
30.950397.Airoldi and De Souza, 1989DH

References

Airoldi and De Souza, 1989
Airoldi, C.; De Souza, A.G., Thermochemical properties of chelates of di-n-butyldithiocarbamate with phosphorus-group elements, J. Chem. Thermodynam., 1989, 21, 283-291. [all data]

Liebman, Simões, et al., 1994
Liebman, Joel F.; Simões, José Artur Martinho; Slayden, Suzanne W., Thermochemistry of Organoarsenic, Antimony and Bismuth Compounds, 1994, 153-168, https://doi.org/10.1002/0470023473.ch4 . [all data]