2-(2-Methoxyethoxy)-tetrahydro-2H-pyran

Gas phase thermochemistry data

Data compiled by: Hussein Y. Afeefy, Joel F. Liebman, and Stephen E. Stein

Quantity Value Units Method Reference Comment
Δfgas-563.00kJ/molCcbPihlaja and Tuomi, 1970

Condensed phase thermochemistry data

Data compiled by: Hussein Y. Afeefy, Joel F. Liebman, and Stephen E. Stein

Quantity Value Units Method Reference Comment
Δfliquid-623.3 ± 4.2kJ/molCcbPihlaja and Tuomi, 1970
Quantity Value Units Method Reference Comment
Δcliquid-4811.4 ± 4.2kJ/molCcbPihlaja and Tuomi, 1970Corresponding Δfliquid = -623.29 kJ/mol (simple calculation by NIST; no Washburn corrections)

Phase change data

Data compiled as indicated in comments:
ALS - Hussein Y. Afeefy, Joel F. Liebman, and Stephen E. Stein
DRB - Donald R. Burgess, Jr.

Quantity Value Units Method Reference Comment
Δvap60. ± 2.kJ/molVPihlaja and Tuomi, 1970ALS
Δvap60.3kJ/molN/APihlaja and Tuomi, 1970DRB

References

Pihlaja and Tuomi, 1970
Pihlaja, K.; Tuomi, M.-L., Bond-Bond interactions in organic oxygen compounds. Part III. Enthalpy of formation of 2-(2-methoxyethoxy)tetrahydropyran and the contributory group increments, Acta Chem. Scand., 1970, 24, 366-368. [all data]