1-Amino-2,5-dimethyl-1H-pyrrole-3,4-dicarboxylicacid diethyl ester

Condensed phase thermochemistry data

Data compiled by: Hussein Y. Afeefy, Joel F. Liebman, and Stephen E. Stein

Quantity Value Units Method Reference Comment
Δfsolid-760.0 ± 6.7kJ/molCcbStern and Klebs, 1933Reanalyzed by Cox and Pilcher, 1970, Original value = -746.8 kJ/mol; Heat of combustion at 288 K
Quantity Value Units Method Reference Comment
Δcsolid-6534.6 ± 6.7kJ/molCcbStern and Klebs, 1933Reanalyzed by Cox and Pilcher, 1970, Original value = -6548.0 kJ/mol; Heat of combustion at 288 K

References

Stern and Klebs, 1933
Stern, A.; Klebs, G., Calorimetrische bestimmungen bei mehrkernigen pyrrolderivaten. IV. 1. Experimentelle daten fur einige porphyrine, chlorine, phaophorbide and purpurine, Ann. Chim., 1933, 505, 295-306. [all data]

Cox and Pilcher, 1970
Cox, J.D.; Pilcher, G., Thermochemistry of Organic and Organometallic Compounds, Academic Press, New York, 1970, 1-636. [all data]