α-Cadinol

Normal alkane RI, non-polar column, temperature ramp

Data compiled by: NIST Mass Spectrometry Data Center, William E. Wallace, director

Column type CapillaryCapillaryCapillaryCapillaryCapillary
Active phase RTX-5 MSRTX-1HP-5 MSRTX-1HP-5 MS
Column length (m) 30.60.30.60.30.
Carrier gas HeliumHeliumHeliumHeliumHelium
Substrate
Column diameter (mm) 0.250.220.250.220.25
Phase thickness (μm)  0.250.250.250.25
Tstart (C) 60.60.50.60.50.
Tend (C) 240.230.180.230.250.
Heat rate (K/min) 3.2.2.2.7.
Initial hold (min)     1.
Final hold (min)  5. 45.5.
I 1663.1643.1654.1632.1639.
ReferencePinheiro, de Queiros, et al., 2013Bendiabdellah, El Amine Dib, et al., 2012Phungpanya, Thongpoon, et al., 2012Yapi, Boti, et al., 2012Zouari, Ayadi, et al., 2012
Comment MSDC-RI MSDC-RI MSDC-RI MSDC-RI MSDC-RI
Column type CapillaryCapillaryCapillaryCapillaryCapillary
Active phase HP-5HP-5 MSHP-5 MSDB-5ZB-5
Column length (m) 30.30.30.30.30.
Carrier gas HeliumHeliumHeliumHeliumNitrogen
Substrate
Column diameter (mm) 0.250.250.250.250.25
Phase thickness (μm) 0.250.250.250.250.25
Tstart (C) 60.60.50.60.40.
Tend (C) 240.220.180.240.200.
Heat rate (K/min) 3.4.2.3.5.
Initial hold (min)  20.  5.
Final hold (min)  20.  5.
I 1654.1640.1649.1653.1656.
ReferenceBertoli, Lepnardi, et al., 2011Feizbakhsh and Naeemy, 2011Hammami, Kamoun, et al., 2011Karimi, Farmani, et al., 2011Vazquez, Demmel, et al., 2011
Comment MSDC-RI MSDC-RI MSDC-RI MSDC-RI MSDC-RI
Column type CapillaryCapillaryCapillaryCapillaryCapillary
Active phase HP-5HP-5HP-5SPB-1DB-5 MS
Column length (m) 30.30.30.30.60.
Carrier gas HeliumHeliumHeliumHeliumHelium
Substrate
Column diameter (mm) 0.250.2520.320.250.25
Phase thickness (μm) 0.250.250.250.250.25
Tstart (C) 50.60.60.50.40.
Tend (C) 300.240.240.250.250.
Heat rate (K/min) 50.3.3.5.5.
Initial hold (min) 5. 2.3.15.
Final hold (min) 5.  15.15.
I 1655.1652.1653.1651.1635.
ReferenceBi Kouame, Bedi, et al., 2010Cavar, Maksimovic, et al., 2010Kahriman, Tosun, et al., 2010Lazarevic, Palic, et al., 2010Mesa-Arango, Betancur-Galvis, et al., 2010
Comment MSDC-RI MSDC-RI MSDC-RI MSDC-RI MSDC-RI
Column type CapillaryCapillaryCapillaryCapillaryCapillary
Active phase BP-1HP-5HP-5SPB-1HP-5 MS
Column length (m)  30.30.30.30.
Carrier gas NitrogenHeliumHeliumHeliumHelium
Substrate
Column diameter (mm)  0.250.250.200.25
Phase thickness (μm)  0.250.250.200.25
Tstart (C) 60.40.50.70.60.
Tend (C) 220.260.240.220.220.
Heat rate (K/min) 5.4.3.3.5.
Initial hold (min) 10. 5. 10.
Final hold (min) 30.5. 15.
I 1646.1661.1650.1624.1656.
ReferenceMishra, Chaudhary, et al., 2010Miyazawa, Kawauchi, et al., 2010Monsef-Esfahani, Miri, et al., 2010Neves, Rosa, et al., 2010Ogunwande, Flamini, et al., 2010
Comment MSDC-RI MSDC-RI MSDC-RI MSDC-RI MSDC-RI
Column type CapillaryCapillaryCapillaryCapillaryCapillary
Active phase HP-5 MSHP-5 MSHP-5HP-5 MSHP-5 MS
Column length (m) 30.30.30.30.30.
Carrier gas HeliumHeliumHydrogenHeliumHelium
Substrate
Column diameter (mm) 0.250.250.250.250.25
Phase thickness (μm) 0.250.250.250.250.25
Tstart (C) 100.70.70.70.60.
Tend (C) 220.290.290.290.220.
Heat rate (K/min) 2.5.5.5.6.
Initial hold (min)     3.
Final hold (min)  10. 10.
I 1652.1666.1664.1648.1642.
ReferencePripdeevech, Chumpolsri, et al., 2010Radulovic, Blagojevic, et al., 2010Radulovic, Dordevic, et al., 2010Radulovic, Dordevic, et al., 2010, 2Safaei-Ghomi and Batooli, 2010
Comment MSDC-RI MSDC-RI MSDC-RI MSDC-RI MSDC-RI
Column type CapillaryCapillaryCapillaryCapillaryCapillary
Active phase DB-1HP-5MSOV-101SE-54DB-5
Column length (m) 30.30.50.30.30.
Carrier gas HeliumHeliumHeliumHeliumHelium
Substrate
Column diameter (mm) 0.250.250.250.250.25
Phase thickness (μm) 0.250.250.250.250.25
Tstart (C) 50.50.70.60.50.
Tend (C) 220.250.220.260.250.
Heat rate (K/min) 4.7.2.2.5.
Initial hold (min) 2.1. 5.2.
Final hold (min) 2.5. 999.
I 1648.1669.1643.1657.1654.
ReferenceXu, Tang, et al., 2010Zouari, Zouari, et al., 2010Benites, Moiteiro, et al., 2009Dayisoylu and Alma, 2009Ho, Wang, et al., 2009
Comment MSDC-RI MSDC-RI MSDC-RI MSDC-RI MSDC-RI
Column type CapillaryCapillaryCapillaryCapillaryCapillary
Active phase HP-5 MSHP-5VF-1 MSRTX-1RTX-1
Column length (m) 30.30.30.60.60.
Carrier gas HydrogenHeliumHeliumHeliumHelium
Substrate
Column diameter (mm) 0.250.320.250.220.22
Phase thickness (μm) 0.250.250.250.250.25
Tstart (C) 30.50.60.60.60.
Tend (C) 230.280.280.230.230.
Heat rate (K/min) 8.5.4.2.2.
Initial hold (min) 5.2.5.
Final hold (min) 10.5.10.30.30.
I 1674.1653.1645.1637.1643.
ReferenceKarlsson, Birgersson, et al., 2009Lago, Favero, et al., 2009Marchesini, Prada, et al., 2009Museli, Pau, et al., 2009Museli, Pau, et al., 2009
Comment MSDC-RI MSDC-RI MSDC-RI MSDC-RI MSDC-RI
Column type CapillaryCapillaryCapillaryCapillaryCapillary
Active phase BP-15 % Phenyl methyl siloxaneDB-5HP-5 MSHP-5 MS
Column length (m) 50.60.30.30.30.
Carrier gas HeliumHeliumNitrogenHelium
Substrate
Column diameter (mm) 0.220.250.250.250.25
Phase thickness (μm) 0.250.250.250.25
Tstart (C) 60.90.40.50.60.
Tend (C) 220.225.230.280.280.
Heat rate (K/min) 2.3.2.4.3.
Initial hold (min)
Final hold (min) 20.3.
I 1644.1653.1654.1659.1654.
ReferenceOttavioli, Bighelli, et al., 2009Retta, Gattuso, et al., 2009Scrivanti, Anton, et al., 2009Zhao, Zeng, et al., 2009Baziou, Couladis, et al., 2008
Comment MSDC-RI MSDC-RI MSDC-RI MSDC-RI MSDC-RI
Column type CapillaryCapillaryCapillaryCapillaryCapillary
Active phase DB-5HP-5 MSDB-5HP-5SLB-5 MS
Column length (m) 25.30.30.30.30.
Carrier gas NitrogenHeliumHeliumHeliumHelium
Substrate
Column diameter (mm) 0.220.250.250.320.25
Phase thickness (μm) 0.250.250.250.250.25
Tstart (C) 50.50.100.100.50.
Tend (C) 300.230.300.240.250.
Heat rate (K/min) 6.54.20.5.3.
Initial hold (min) 2.4.2.2.2.
Final hold (min) 7.10.10.5.10.
I 1677.1654.1653.1653.1659.
ReferenceChieng, Assim, et al., 2008Forero, Quijano, et al., 2008Khokra, Prakash, et al., 2008Lago, Romoff, et al., 2008Lo Presti, Sciarrone, et al., 2008
Comment MSDC-RI MSDC-RI MSDC-RI MSDC-RI MSDC-RI
Column type CapillaryCapillaryCapillaryCapillaryCapillary
Active phase DB-5 MSRTX-1Elite-1HP-5 MSHP-5
Column length (m) 30.60.30.30.30.
Carrier gas HeliumHeHeliumHeliumNitrogen
Substrate
Column diameter (mm) 0.250.220.320.250.25
Phase thickness (μm) 0.250.250.250.250.25
Tstart (C) 50.60.60.60.50.
Tend (C) 300.230.246.250.280.
Heat rate (K/min) 5.2.3.2.5.
Initial hold (min) 5.  8.1.
Final hold (min) 5.35. 15.1.
I 1650.1643.1649.1651.1648.
ReferenceNoudogbessi, Yedomonhan, et al., 2008Paolini, Tomi, et al., 2008Raj, Baby, et al., 2008Sahraoui, Vian, et al., 2008Saidana, Mahjoub, et al., 2008
Comment MSDC-RI MSDC-RI MSDC-RI MSDC-RI MSDC-RI
Column type CapillaryCapillaryCapillaryCapillaryCapillary
Active phase HP-5 MSHP-5HP-5HP-5MSDB-5
Column length (m) 30.25.30.30.30.
Carrier gas HeliumHeliumHeliumHeHe
Substrate
Column diameter (mm) 0.250.250.250.250.26
Phase thickness (μm) 0.250.250.320.250.25
Tstart (C) 50.60.60.60.60.
Tend (C) 240.240.250.240.240.
Heat rate (K/min) 3.4.5.3.3.
Initial hold (min)  2.30.
Final hold (min)
I 1698.1652.1653.1680.1646.
ReferenceSarikurkcu, Tepe, et al., 2008Verdian-rizi, 2008Yassa and Akhani, 2008Argyropoulou, Daferera, et al., 2007Bos, Woerdenbag, et al., 2007
Comment MSDC-RI MSDC-RI MSDC-RI MSDC-RI MSDC-RI
Column type CapillaryCapillaryCapillaryCapillaryCapillary
Active phase HP-5RTX-5 MSDB-5HP-5MSHP-5MS
Column length (m) 30.30.30.30.30.
Carrier gas N2HeHeliumHeHe
Substrate
Column diameter (mm) 0.250.250.260.250.25
Phase thickness (μm) 0.250.250.250.250.25
Tstart (C) 50.60.60.60.60.
Tend (C) 240.200.290.250.250.
Heat rate (K/min) 5.2.3.2.2.
Initial hold (min) 1.2. 8.8.
Final hold (min) 4.10. 15.15.
I 1653.1648.1646.1651.1657.
ReferenceCheraif, Ben Jannet, et al., 2007Edris, Chizzola, et al., 2007Elfami, Bos, et al., 2007Ferhat, Meklati, et al., 2007Ferhat, Tigrine-Kordjani, et al., 2007
Comment MSDC-RI MSDC-RI MSDC-RI MSDC-RI MSDC-RI
Column type CapillaryCapillaryCapillaryCapillaryCapillary
Active phase Col-Elite 5MSHP-1DB-5ZB-5DB-5
Column length (m) 30.30.30.30.30.
Carrier gas HeHeHe Helium
Substrate
Column diameter (mm) 0.250.250.250.250.25
Phase thickness (μm) 0.250.250.250.250.25
Tstart (C) 30.60.60.60.60.
Tend (C) 246.240.300.220.300.
Heat rate (K/min) 3.2.3.4.3.
Initial hold (min)    5.
Final hold (min)  20. 20.
I 1668.1630.1640.1660.1630.
ReferenceGudaityte and Venskutonis R.P., 2007Hachicha, Skanji, et al., 2007Limberger, Scopel, et al., 2007Mohottalage, Tabacchi, et al., 2007Moreno, Lima, et al., 2007
Comment MSDC-RI MSDC-RI MSDC-RI MSDC-RI MSDC-RI
Column type CapillaryCapillaryCapillaryCapillaryCapillary
Active phase DB-5HP-5Methyl SiliconeHP-5 MSSPB-1
Column length (m) 30.25.50.25.30.
Carrier gas HeliumH2HeliumHeliumHe
Substrate
Column diameter (mm) 0.250.20.250.250.2
Phase thickness (μm) 0.250.33 0.250.2
Tstart (C) 60.60.50.100.70.
Tend (C) 220.240.240.280.220.
Heat rate (K/min) 4.3.3.4.3.
Initial hold (min)    3.
Final hold (min)    5.15.
I 1655.1656.1671.1662.1628.
ReferenceMorteza-Semnani, Saeedi, et al., 2007Oliveira, Leitão, et al., 2007Ozcan and Chalchat, 2007Phutdhawong, Kawaree, et al., 2007Pinto, Salgueiro, et al., 2007
Comment MSDC-RI MSDC-RI MSDC-RI MSDC-RI MSDC-RI
Column type CapillaryCapillaryCapillaryCapillaryCapillary
Active phase HP-5DB-5Elite-5MSHP-5MSHP-5 MS
Column length (m) 30.30.30.30.30.
Carrier gas Helium HeHeHelium
Substrate
Column diameter (mm) 0.250.250.320.250.25
Phase thickness (μm) 0.250.250.50.250.25
Tstart (C) 40.40.40.60.60.
Tend (C) 260.210.280.280.280.
Heat rate (K/min) 4.2.4.3.3.
Initial hold (min)   5.
Final hold (min)  33.10.
I 1648.1652.1661.1608.1654.
ReferenceRistic, Krivokuca-Dokic, et al., 2007Sylvestre, Longtin, et al., 2007Tava, Pecetti, et al., 2007Tzakou, Bazos, et al., 2007Vagionas, Graikou, et al., 2007
Comment MSDC-RI MSDC-RI MSDC-RI MSDC-RI MSDC-RI
Column type CapillaryCapillaryCapillaryCapillaryCapillary
Active phase HP-5MSHP-5HP-5MSDB-5DB-5
Column length (m) 30.30.30.30.30.
Carrier gas HeHeHeHe
Substrate
Column diameter (mm) 0.250.250.250.250.25
Phase thickness (μm) 0.250.320.250.250.25
Tstart (C) 40.60.40.60.60.
Tend (C) 250.250.260.300.300.
Heat rate (K/min) 3.5.4.3.3.
Initial hold (min) 5.30.
Final hold (min) 10.
I 1651.1653.1653.71644.1648.
ReferenceVichi, Riu-Aumatell, et al., 2007Yassa and Akhani, 2007Zizovic, Stamenic, et al., 2007Apel, Sobral, et al., 2006Apel, Sobral, et al., 2006, 2
Comment MSDC-RI MSDC-RI MSDC-RI MSDC-RI MSDC-RI
Column type CapillaryCapillaryCapillaryCapillaryCapillary
Active phase CP Sil 5 CBBP-1SPB-1DB-1DB-5
Column length (m) 25.50.30.60.30.
Carrier gas He HeliumNitrogen
Substrate
Column diameter (mm)  0.220.200.250.32
Phase thickness (μm)  0.250.20 0.25
Tstart (C) 80.60.70.40.60.
Tend (C) 270.220.220.200.230.
Heat rate (K/min) 10.2.3.2.3.
Initial hold (min)    1.
Final hold (min)  20.15.9.15.
I 1663.1638.1628.1637.1653.
ReferenceAyoub, Al-Azizi, et al., 2006Boti, Yao, et al., 2006Cavaleiro, Pinto, et al., 2006Chen, Sheu, et al., 2006Damjanovic, Skala, et al., 2006
Comment MSDC-RI MSDC-RI MSDC-RI MSDC-RI MSDC-RI
Column type CapillaryCapillaryCapillaryCapillaryCapillary
Active phase HP-5MSDB-5HP-1HP-5DB-5
Column length (m) 30.30.50.30.30.
Carrier gas  HeliumHeHe
Substrate
Column diameter (mm) 0.250.260.20.250.25
Phase thickness (μm) 0.250.250.330.250.25
Tstart (C) 60.60.60.50.40.
Tend (C) 280.290.250.300.210.
Heat rate (K/min) 4.3.2.5.2.
Initial hold (min)    5.2.
Final hold (min)   60.5.33.
I 1651.1646.1635.1656.1652.
ReferenceEbrahim Sajjadi and Mehregan, 2006Elfami, Komar, et al., 2006Fernandez, Pintaric, et al., 2006Figuérédo, Cabassu, et al., 2006Garneau F.X., Collin G., et al., 2006
Comment MSDC-RI MSDC-RI MSDC-RI MSDC-RI MSDC-RI
Column type CapillaryCapillaryCapillaryCapillaryCapillary
Active phase DB-5HP-5RTX-1BP-1CP Sil 5 CB
Column length (m) 30.30.30.50.30.
Carrier gas HeliumHeliumHeHeN2
Substrate
Column diameter (mm) 0.250.320.320.220.32
Phase thickness (μm) 0.250.250.250.250.25
Tstart (C) 60.60.60.60.50.
Tend (C) 260.260.300.220.300.
Heat rate (K/min) 3.5.4.2.4.
Initial hold (min)  2.
Final hold (min)  13. 20.
I 1653.1657.1643.1641.1636.
ReferenceJavidnia, Miri, et al., 2006Kucuk, Gulec, et al., 2006Kula, Izydorczyk, et al., 2006Lesueur, Ban, et al., 2006Lis and Milczarek, 2006
Comment MSDC-RI MSDC-RI MSDC-RI MSDC-RI MSDC-RI
Column type CapillaryCapillaryCapillaryCapillaryCapillary
Active phase DB-5DB-5CP-Sil 5 CBNB-30DB-5
Column length (m) 30.30.25.30.25.
Carrier gas HeHeHydrogenHeN2
Substrate
Column diameter (mm) 0.250.250.250.20.25
Phase thickness (μm) 0.250.250.150.250.15
Tstart (C) 60.60.50.50.50.
Tend (C) 220.220.230.250.200.
Heat rate (K/min) 4.4.3.2.4.
Initial hold (min)  5.  3.
Final hold (min)
I 1656.1656.1643.1644.1643.
ReferenceMorteza-Semnani, Akbarzadeh, et al., 2006Morteza-Semnani K., Saeedi M., et al., 2006Olawore, Usman, et al., 2006Orav, Raal, et al., 2006Ouamba, Ouabonzi, et al., 2006
Comment MSDC-RI MSDC-RI MSDC-RI MSDC-RI MSDC-RI
Column type CapillaryCapillaryCapillaryCapillaryCapillary
Active phase DB-5DB-5HP-5HP-5DB-5
Column length (m) 30.30.30.25.30.
Carrier gas HydrogenHydrogenH2H2He
Substrate
Column diameter (mm) 0.250.250.250.320.25
Phase thickness (μm) 0.250.250.250.250.25
Tstart (C) 70.70.50.60.60.
Tend (C) 280.280.280.240.200.
Heat rate (K/min) 4.4.4.3.2.
Initial hold (min) 4.4.2.
Final hold (min)   10. 60.
I 1653.1652.1653.1658.1653.
ReferencePino, Marbot, et al., 2006Pino, Marbot, et al., 2006Pino, Sauri-Duch, et al., 2006Potzernheim, Bizzo, et al., 2006Rout, Naik, et al., 2006
Comment MSDC-RI MSDC-RI MSDC-RI MSDC-RI MSDC-RI
Column type CapillaryCapillaryCapillaryCapillaryCapillary
Active phase DB-5HP-5MSDB-1CP Sil 5 CBMethyl Silicone
Column length (m) 30.30.60.25.25.
Carrier gas HeHeHelium N2
Substrate
Column diameter (mm) 0.250.320.250.250.3
Phase thickness (μm) 0.250.250.25 0.15
Tstart (C) 60.60.60.50.50.
Tend (C) 260.243.250.230.210.
Heat rate (K/min) 5.3.5.3.2.
Initial hold (min)     5.
Final hold (min)   10.
I 1670.1651.1610.1644.1674.
ReferenceSabulal, Dan, et al., 2006Sabulal, Dan, et al., 2006, 2Sonboli, Mirjalili, et al., 2006Tesso, Kubeczka, et al., 2006Tonzibo, Coffy, et al., 2006
Comment MSDC-RI MSDC-RI MSDC-RI MSDC-RI MSDC-RI
Column type CapillaryCapillaryCapillaryCapillaryCapillary
Active phase DB-1SPB-1SPB-1DB-5MSDB-5
Column length (m) 50.50.30.30.25.
Carrier gas N2HeHeHe
Substrate
Column diameter (mm) 0.250.20.250.250.25
Phase thickness (μm) 0.250.330.250.250.15
Tstart (C) 90.50.50.60.40.
Tend (C) 240.220.250.240.220.
Heat rate (K/min) 4.4.4.3.3.
Initial hold (min)  1.1. 5.
Final hold (min)  10.10.
I 1650.1622.1619.1654.1655.
ReferenceVelasco-Negueruela, Pérez-Alonso, et al., 2006Wong, Lim, et al., 2006Wong, Sivasothy, et al., 2006Busman, Zoghbi, et al., 2005Chagonda and Chalchat, 2005
Comment MSDC-RI MSDC-RI MSDC-RI MSDC-RI MSDC-RI
Column type CapillaryCapillaryCapillaryCapillaryCapillary
Active phase DB-5DB-5HP-5CP Sil 8 CBDB-1
Column length (m) 30.30.25.30.60.
Carrier gas HeHeHeHeN2
Substrate
Column diameter (mm) 0.250.250.20.250.25
Phase thickness (μm) 0.250.250.330.250.25
Tstart (C) 60.60.60.80.60.
Tend (C) 240.240.240.200.250.
Heat rate (K/min) 3.3.3.3.5.
Initial hold (min)    5.
Final hold (min)   7.5.10.
I 1653.1650.1651.1656.1654.
ReferenceChaverri and Cicció, 2005Chaverri and Cicció, 2005Duarte, Figueira, et al., 2005Facey, Porter, et al., 2005Fakhari A.R., Sonboli A., et al., 2005
Comment MSDC-RI MSDC-RI MSDC-RI MSDC-RI MSDC-RI
Column type CapillaryCapillaryCapillaryCapillaryCapillary
Active phase DB-5HP-5HP-5HP-5MSDB-5
Column length (m) 30.30.30.30.30.
Carrier gas HeHeHeHe
Substrate
Column diameter (mm) 0.250.250.250.250.25
Phase thickness (μm) 0.250.250.250.250.25
Tstart (C) 60.60.50.60.35.
Tend (C) 300.30.300.200.280.
Heat rate (K/min) 3.4.5.4.4.
Initial hold (min) 3.3.5.30.2.
Final hold (min)  15.5.
I 1654.1655.1656.1650.1661.
ReferenceFerraz, Limberger, et al., 2005Ferretti, Maggi, et al., 2005Figuérédo, Cabassu, et al., 2005Gauvin and Smadja, 2005Kowalski and Wolski, 2005
Comment MSDC-RI MSDC-RI MSDC-RI MSDC-RI MSDC-RI
Column type CapillaryCapillaryCapillaryCapillaryCapillary
Active phase DB-5DB-5DB-5CP Sil 5 CBHP-5
Column length (m) 30.30.30.25.30.
Carrier gas HeHeHe He
Substrate
Column diameter (mm) 0.250.250.250.250.25
Phase thickness (μm) 0.250.250.250.150.25
Tstart (C) 60.60.60.50.70.
Tend (C) 230.220.220.230.240.
Heat rate (K/min) 3.4.4.3.5.
Initial hold (min)  5.4.
Final hold (min)
I 1647.1654.1655.1643.1654.
ReferenceLimberger, Sobral, et al., 2005Morteza-Semnani, Akbarzadeh, et al., 2005Morteza-Semnani and Saeedi, 2005Olawore, Ogunwande, et al., 2005Oyedeji, Yani, et al., 2005
Comment MSDC-RI MSDC-RI MSDC-RI MSDC-RI MSDC-RI
Column type CapillaryCapillaryCapillaryCapillaryCapillary
Active phase DB-1HP-5MSHP-5MSDB-1DB-5
Column length (m) 50.30.30.30.30.
Carrier gas N2 HeHeHe
Substrate
Column diameter (mm) 0.250.20.250.250.25
Phase thickness (μm) 0.25 0.250.25
Tstart (C) 95.60.60.50.40.
Tend (C) 240.280.280.265.240.
Heat rate (K/min) 4.3.4.2.54.
Initial hold (min)    1.
Final hold (min)    20.
I 1651.1655.1654.1617.1651.
ReferencePala-Paul, Perez-Alonso, et al., 2005Petrakis, Roussis, et al., 2005Sajjadi S.E. and Eskandari B., 2005Sarkhail, Amin, et al., 2005Sefidkon and Jamzad, 2005
Comment MSDC-RI MSDC-RI MSDC-RI MSDC-RI MSDC-RI
Column type CapillaryCapillaryCapillaryCapillaryCapillary
Active phase DB-5HP-5MSDB-5DB-5DB-5
Column length (m) 30.30.30.30.30.
Carrier gas HeHeHeHeHe
Substrate
Column diameter (mm) 0.250.250.250.250.25
Phase thickness (μm) 0.250.250.250.250.25
Tstart (C) 40.60.60.60.60.
Tend (C) 260.280.300.300.300.
Heat rate (K/min) 2.3.3.3.3.
Initial hold (min) 5.5.
Final hold (min) 20.
I 1655.1652.1649.1649.1650.
ReferenceSenatore, Apostolides Arnold, et al., 2005Setzer, Noletto, et al., 2005Simoes-Pires C.A., Debenedetti S., et al., 2005Simoes-Pires C.A., Debenedetti S., et al., 2005Simoes-Pires C.A., Debenedetti S., et al., 2005
Comment MSDC-RI MSDC-RI MSDC-RI MSDC-RI MSDC-RI
Column type CapillaryCapillaryCapillaryCapillaryCapillary
Active phase PE-5HP-5MSRTX-1DB-1BP-1
Column length (m) 30.30.60.60.30.
Carrier gas H2HeHeHeN2
Substrate
Column diameter (mm) 0.320.250.250.250.32
Phase thickness (μm) 0.250.250.250.250.25
Tstart (C) 60.60.60.60.60.
Tend (C) 230.280.25.250.220.
Heat rate (K/min) 5.3.5.5.5.
Initial hold (min) 2.
Final hold (min) 4. 10.10.15.
I 1648.1658.1635.1632.1656.
ReferenceSingh, Raina, et al., 2005Slavkovska, Couladis, et al., 2005Sonboli, Salehi, et al., 2005Sonboli, Salehi, et al., 2005, 2Srivastava, Srivastava, et al., 2005
Comment MSDC-RI MSDC-RI MSDC-RI MSDC-RI MSDC-RI
Column type CapillaryCapillaryCapillaryCapillaryCapillary
Active phase DB-5CP Sil 8 CBRTX-5HP-5MSDB-5
Column length (m) 30.30.30.30.30.
Carrier gas  He HeHe
Substrate
Column diameter (mm) 0.250.250.250.250.32
Phase thickness (μm) 0.25 0.250.250.25
Tstart (C) 40.60.60.60.60.
Tend (C) 210.290.220.280.280.
Heat rate (K/min) 2.3.3.3.3.
Initial hold (min) 2.5.
Final hold (min) 33.
I 1659.1648.1653.1617.1628.
ReferenceStevanovic, Garneau, et al., 2005Suárez, Vásquez, et al., 2005Szafranek, Chrapkowska, et al., 2005Tzakou, Bazos, et al., 2005Tzakou and Constantinidis, 2005
Comment MSDC-RI MSDC-RI MSDC-RI MSDC-RI MSDC-RI
Column type CapillaryCapillaryCapillaryCapillaryCapillary
Active phase HP-5 MSDB-1DB-1HP-5MSCP Sil 5 CB
Column length (m) 30.50.50.30.30.
Carrier gas HeliumN2  N2
Substrate
Column diameter (mm) 0.250.250.250.250.25
Phase thickness (μm) 0.250.250.250.250.25
Tstart (C) 60.90.60.40.50.
Tend (C) 240.240.240.220.200.
Heat rate (K/min) 3.4.3.3.5.
Initial hold (min)    5.
Final hold (min)    10.
I 1654.1648.1626.1651.1648.
ReferenceUrdampilleta, Amat, et al., 2005Velasco-Negueruela, Pérez-Alonso, et al., 2005Velasco-Negueruela, Pérez-Alonso, et al., 2005, 2Vichi, Riu-Aumatell, et al., 2005Agnaniet, Menut, et al., 2004
Comment MSDC-RI MSDC-RI MSDC-RI MSDC-RI MSDC-RI
Column type CapillaryCapillaryCapillaryCapillaryCapillary
Active phase BP-1DB-1DB-5DB-5RTX-1
Column length (m) 50.30.30.60.30.
Carrier gas  N2N2HeN2
Substrate
Column diameter (mm) 0.220.250.250.250.25
Phase thickness (μm) 0.250.250.250.250.25
Tstart (C) 60.50.40.40.60.
Tend (C) 220.200.230.280.300.
Heat rate (K/min) 2.5.2.4.4.
Initial hold (min)    4.
Final hold (min) 20.
I 1640.1637.1653.1659.1642.
ReferenceBlanc, Muselli, et al., 2004Fekam Boyom, Fotio, et al., 2004González, Guerra, et al., 2004Kalvandi, Sefidkon, et al., 2004Kalemba and Thiem, 2004
Comment MSDC-RI MSDC-RI MSDC-RI MSDC-RI MSDC-RI
Column type CapillaryCapillaryCapillaryCapillaryCapillary
Active phase DB-5DB-5DB-5HP-5MSHP-5MS
Column length (m) 30.30.30.30.30.
Carrier gas HeHe HeHe
Substrate
Column diameter (mm) 0.250.250.250.250.25
Phase thickness (μm) 0.250.250.250.250.25
Tstart (C) 60.60.40.60.60.
Tend (C) 300.300.210.280.280.
Heat rate (K/min) 3.3.2.3.3.
Initial hold (min)   2.
Final hold (min)   33.
I 1662.1646.1653.1651.1651.
ReferenceLago, de Ávila, et al., 2004Limberger, Sobral, et al., 2004Lopez Arze, Collin, et al., 2004Malencic, Couladis, et al., 2004Malencic, Couladis, et al., 2004
Comment MSDC-RI MSDC-RI MSDC-RI MSDC-RI MSDC-RI
Column type CapillaryCapillaryCapillaryCapillaryCapillary
Active phase BP-1HP-5MSNB-30NB-30DB-1
Column length (m) 25.30.50.50.50.
Carrier gas N2HeHeHeN2
Substrate
Column diameter (mm) 0.250.250.20.20.25
Phase thickness (μm) 0.250.250.250.250.25
Tstart (C) 60.60.50.50.95.
Tend (C) 220.275.250.250.240.
Heat rate (K/min) 5.4.2.2.4.
Initial hold (min)
Final hold (min)
I 1645.1662.1644.1643.1630.
ReferenceMallavarapu, Kulkarni, et al., 2004Mehrabani, Asadipour, et al., 2004Orav, Stulova, et al., 2004Orav, Stulova, et al., 2004Palá-Paúl, Velasco-Negueruela, et al., 2004
Comment MSDC-RI MSDC-RI MSDC-RI MSDC-RI MSDC-RI
Column type CapillaryCapillaryCapillaryCapillaryCapillary
Active phase NB-30DB-5Methyl SiliconeHP-5 MSHP-5MS
Column length (m) 50.30.60.30.30.
Carrier gas HeHeHeHeliumHe
Substrate
Column diameter (mm) 0.200.250.250.250.25
Phase thickness (μm) 0.250.250.250.250.25
Tstart (C) 50.35.60.60.60.
Tend (C) 250.220.200.200.280.
Heat rate (K/min) 2.2.54.4.3.
Initial hold (min)   1.1.
Final hold (min)  6.20.20.
I 1644.1654.1650.1650.1655.
ReferenceRaal, Paaver, et al., 2004Rohloff, Mordal, et al., 2004Rojas, Usubillaga, et al., 2004Royas, Usubillaga, et al., 2004Couladis, Özcan, et al., 2003
Comment MSDC-RI MSDC-RI MSDC-RI MSDC-RI MSDC-RI
Column type CapillaryCapillaryCapillaryCapillaryCapillary
Active phase RTX-5SilHP-5MSHP-1DB-1HP-5MS
Column length (m) 30.30.30.30.30.
Carrier gas HeHeHeN2He
Substrate
Column diameter (mm) 0.250.250.250.250.25
Phase thickness (μm) 0.250.250.250.250.25
Tstart (C) 70.60.70.50.60.
Tend (C) 200.220.200.200.275.
Heat rate (K/min) 4.5.10.5.4.
Initial hold (min)  20.
Final hold (min) 10.20.
I 1629.1660.1637.1638.1657.
ReferenceDudai, Larkov, et al., 2003Feizbaksh, Saber Tehrani, et al., 2003Fekam Boyom, Amvam Zollo, et al., 2003Fekam Boyom, Ngouana, et al., 2003Ghannadi, Aghazari, et al., 2003
Comment MSDC-RI MSDC-RI MSDC-RI MSDC-RI MSDC-RI
Column type CapillaryCapillaryCapillaryCapillaryCapillary
Active phase Methyl SiliconeRSL-200RSL-200DB-5DB-5
Column length (m) 30.30.30.30.30.
Carrier gas HeH2H2HeHe
Substrate
Column diameter (mm) 0.320.320.320.250.25
Phase thickness (μm) 0.250.250.250.250.25
Tstart (C) 60.40.40.60.60.
Tend (C) 250.280.280.250.280.
Heat rate (K/min) 2.6.6.3.3.
Initial hold (min) 2.5.5.
Final hold (min) 5.5.5. 30.
I 1638.1647.1641.1649.1636.
ReferenceJayaprakasha, Rao, et al., 2003Jirovetz, Buchbauer, et al., 2003Jirovetz, Buchbauer, et al., 2003, 2Limberger, Simões-Pires, et al., 2003Marongiu, Porcedda, et al., 2003
Comment MSDC-RI MSDC-RI MSDC-RI MSDC-RI MSDC-RI
Column type CapillaryCapillaryCapillaryCapillaryCapillary
Active phase DB-5DB-5DB-5HP-5HP-5
Column length (m) 30.30.30.30.30.
Carrier gas HeHeH2HeHe
Substrate
Column diameter (mm) 0.250.250.250.250.25
Phase thickness (μm) 0.250.250.250.250.25
Tstart (C) 60.60.60.60.60.
Tend (C) 280.280.280.280.280.
Heat rate (K/min) 3.3.4.3.4.
Initial hold (min)   10.
Final hold (min) 30.30.40.
I 1642.1643.1653.1635.1650.
ReferenceMarongiu, Porcedda, et al., 2003Marongiu, Porcedda, et al., 2003Pino, Marbot, et al., 2003Pitarokili, Tzakou, et al., 2003Sajjadi and Mehregan, 2003
Comment MSDC-RI MSDC-RI MSDC-RI MSDC-RI MSDC-RI
Column type CapillaryCapillaryCapillaryCapillaryCapillary
Active phase HP-5DB-5DB-1DB-5HP-5
Column length (m) 30.30.60.30.60.
Carrier gas He HeHe
Substrate
Column diameter (mm) 0.250.250.250.250.25
Phase thickness (μm) 0.250.250.250.250.25
Tstart (C) 60.40.50.60.40.
Tend (C) 280.260.280.240.250.
Heat rate (K/min) 4.2.4.3.5.
Initial hold (min)  5.  15.
Final hold (min)
I 1649.1653.1634.1657.1653.
ReferenceSajjadi and Mehregan, 2003, 2Senatore and Bruno, 2003Shahmir, Ahmadi, et al., 2003da Silva, Luz, et al., 2003Stashenko, Jaramillo, et al., 2003
Comment MSDC-RI MSDC-RI MSDC-RI MSDC-RI MSDC-RI
Column type CapillaryCapillaryCapillaryCapillaryCapillary
Active phase HP-5DB-5DB-1OV-101HP-1
Column length (m) 60.30.60.25.30.
Carrier gas  HeHe He
Substrate
Column diameter (mm) 0.250.250.250.320.25
Phase thickness (μm) 0.250.250.25 0.25
Tstart (C) 40.60.50.50.70.
Tend (C) 250.240.280.200.220.
Heat rate (K/min) 5.3.4.5.3.
Initial hold (min) 15.
Final hold (min)     15.
I 1654.1654.1634.1638.1627.
ReferenceStashenko, Jaramillo, et al., 2003Zoghbi, Andrade, et al., 2003Ahmadi, Mirza, et al., 2002Boyom, Keumedjio, et al., 2002Cavaleiro, Salgueiro, et al., 2002
Comment MSDC-RI MSDC-RI MSDC-RI MSDC-RI MSDC-RI
Column type CapillaryCapillaryCapillaryCapillaryCapillary
Active phase 5 % Phenyl methyl siloxaneDB-5PTE-5SE-30RSL-200
Column length (m) 30.30.60.50.30.
Carrier gas HeHeH2HeH2
Substrate
Column diameter (mm) 0.250.250.320.250.32
Phase thickness (μm) 0.250.250.300.250.25
Tstart (C) 75.60.60.70.40.
Tend (C) 200.240.285.240.280.
Heat rate (K/min) 3.3.4.34.6.
Initial hold (min) 4.   5.
Final hold (min) 8.   5.
I 1654.1656.1653.1644.1676.
ReferenceCicció and Gómez-Laurito, 2002Flamini, Ertugrul, et al., 2002Gudzic, Djokovic, et al., 2002Iñigo, Palá-Paúl, et al., 2002Jirovetz, Buchbauer, et al., 2002
Comment MSDC-RI MSDC-RI MSDC-RI MSDC-RI MSDC-RI
Column type CapillaryCapillaryCapillaryCapillaryCapillary
Active phase CP Sil 8 CBDB-5DB-1DB-5DB-5
Column length (m) 30.30.25.30.30.
Carrier gas He HeHeHe
Substrate
Column diameter (mm) 0.250.250.230.250.25
Phase thickness (μm) 0.250.250.200.250.25
Tstart (C) 50.40.50.60.35.
Tend (C) 220.210.200.240.280.
Heat rate (K/min) 3.2.3.3.3.
Initial hold (min) 2.2.3. 2.
Final hold (min)  33.30. 15.
I 1640.1658.1642.1653.1665.
ReferenceJuteau, Masotti, et al., 2002Kabouss, Charrouf, et al., 2002Khallouki, Younos, et al., 2002Kobaisy, Tellez, et al., 2002Krauze-Baranowska, Mardarowicz, et al., 2002
Comment MSDC-RI MSDC-RI MSDC-RI MSDC-RI MSDC-RI
Column type CapillaryCapillaryCapillaryCapillaryCapillary
Active phase DB-5OV-101DB-5HP-5DB-5
Column length (m) 30.25.30.30.30.
Carrier gas HeHeHe He
Substrate
Column diameter (mm) 0.250.320.250.250.25
Phase thickness (μm) 0.25 0.250.250.25
Tstart (C) 35.50.60.60.60.
Tend (C) 280.200.250.275.240.
Heat rate (K/min) 4.5.3.4.3.
Initial hold (min) 2.  4.
Final hold (min) 15.
I 1667.1627.1647.1652.1654.
ReferenceKrauze-Baranowska, Mardarowicz, et al., 2002, 2Kuiate, Bessière, et al., 2002Limberger, Simões-Pires, et al., 2002Lockwood, Asghari, et al., 2002Maia, da Silva, et al., 2002
Comment MSDC-RI MSDC-RI MSDC-RI MSDC-RI MSDC-RI
Column type CapillaryCapillaryCapillaryCapillaryCapillary
Active phase DB-5MSOV-101DB-5DB-1SPB-5
Column length (m) 30.25.30.30.30.
Carrier gas HeHeHeHeHelium
Substrate
Column diameter (mm) 0.250.320.250.250.25
Phase thickness (μm) 0.25 0.250.250.25
Tstart (C) 60.50.60.60.60.
Tend (C) 240.200.220.250.250.
Heat rate (K/min) 3.5.4.4.4.
Initial hold (min)   5.10.2.
Final hold (min)     20.
I 1652.1647.1654.1670.1653.
ReferenceMaia, Zoghbi, et al., 2002Menut, Bessière, et al., 2002Morteza-Semnani, Saeedi, et al., 2002Norouzi-Arasi, Yavari, et al., 2002Pino, Marbot, et al., 2002
Comment MSDC-RI MSDC-RI MSDC-RI MSDC-RI MSDC-RI
Column type CapillaryCapillaryCapillaryCapillaryCapillary
Active phase DB-5DB-1DB-1DB-5MSDB-5
Column length (m) 25.60.50.30.30.
Carrier gas HeHeN2HeHe
Substrate
Column diameter (mm) 0.20.250.250.250.25
Phase thickness (μm)   0.250.250.25
Tstart (C) 60.40.60.60.60.
Tend (C) 220.250.240.270.240.
Heat rate (K/min) 3.4.3.3.3.
Initial hold (min)
Final hold (min)
I 1642.1629.1626.1655.1655.
ReferenceSchwob, Bessière, et al., 2002Sefidkon, Dabiri, et al., 2002Velasco-Negueruela, Pérez-Alonso, et al., 2002Zoghbi, Andrade, et al., 2002Zoghbi, Andrade, et al., 2002, 2
Comment MSDC-RI MSDC-RI MSDC-RI MSDC-RI MSDC-RI
Column type CapillaryCapillaryCapillaryCapillaryCapillary
Active phase DB-5MSOptima-5RTX-1DB-5MSDB-5
Column length (m) 30.30.30.30.30.
Carrier gas HeHeN2HeHe
Substrate
Column diameter (mm) 0.250.20.250.250.25
Phase thickness (μm) 0.25 0.250.250.25
Tstart (C) 60.50.60.60.60.
Tend (C) 240.250.300.240.270.
Heat rate (K/min) 3.3.4.3.3.
Initial hold (min)  3.
Final hold (min)    30.
I 1637.1663.1644.1631.1654.
ReferenceCherchi, Deidda, et al., 2001Jacquemond-Collet, Bessière, et al., 2001Kalemba, Marschall, et al., 2001Marongiu, Porcedda, et al., 2001Palmeira, Conserva, et al., 2001
Comment MSDC-RI MSDC-RI MSDC-RI MSDC-RI MSDC-RI
Column type CapillaryCapillaryCapillaryCapillaryCapillary
Active phase DB-1DB-1DB-1HP-5HP-5
Column length (m) 30.30.60.30.30.
Carrier gas N2HeN2H2He
Substrate
Column diameter (mm) 0.250.20.250.250.25
Phase thickness (μm) 0.25 0.250.250.25
Tstart (C) 80.60.60.40.40.
Tend (C) 225.240.220.280.240.
Heat rate (K/min) 4.3.3.3.3.
Initial hold (min)   5.10.5.
Final hold (min)   22.10.
I 1620.1661.01651.1656.1649.
ReferencePalá-Paúl, Pérez-Alonso, et al., 2001Santos, Moreira, et al., 2001Bailac, Dellacasa, et al., 2000Bicalho, Pereira, et al., 2000Novak, Novak, et al., 2000
Comment MSDC-RI MSDC-RI MSDC-RI MSDC-RI MSDC-RI
Column type CapillaryCapillaryCapillaryCapillaryCapillary
Active phase DB-5OV-101RTX-1OV-101OV-101
Column length (m) 30.25.30.25.50.
Carrier gas HeN2N2 N2
Substrate
Column diameter (mm) 0.250.250.250.320.2
Phase thickness (μm) 0.25 0.25
Tstart (C) 60.50.60.50.80.
Tend (C) 240.200.300.200.200.
Heat rate (K/min) 3.5.4.5.1.
Initial hold (min)
Final hold (min)     20.
I 1653.1648.1651.1627.1648.
ReferenceTellez, Dayan, et al., 2000Ayedoun, Adéoti, et al., 1999Kalemba, 1999Kuiate, Zollo, et al., 1999Menon, Chacko, et al., 1999
Comment MSDC-RI MSDC-RI MSDC-RI MSDC-RI MSDC-RI
Column type CapillaryCapillaryCapillaryCapillaryCapillary
Active phase CP Sil 5 CBDB-5DB-5DB-5OV-1
Column length (m) 25.30.30.30.50.
Carrier gas HeHeHeHeHe
Substrate
Column diameter (mm) 0.250.250.250.250.32
Phase thickness (μm) 0.390.250.250.250.25
Tstart (C) 60.60.60.60.50.
Tend (C) 220.240.240.240.250.
Heat rate (K/min) 5.3.3.3.10.
Initial hold (min) 5.   5.
Final hold (min) 20.   20.
I 1643.1652.1652.1653.1669.
ReferenceRustaiyan, Masoudi, et al., 1999Tellez, Canel, et al., 1999Zoghbi, Andrade, et al., 1999El-Sakhawy, El-Tantawy, et al., 1998Kökdil, Kurucu, et al., 1998
Comment MSDC-RI MSDC-RI MSDC-RI MSDC-RI MSDC-RI
Column type CapillaryCapillaryCapillaryCapillaryCapillary
Active phase DB-5DB-5HP-1OV-101DB-1
Column length (m) 30.30.60.25.
Carrier gas HeHeliumHe
Substrate
Column diameter (mm) 0.250.250.250.32
Phase thickness (μm) 0.250.250.25
Tstart (C) 60.60.50.50.80.
Tend (C) 240.240.280.200.220.
Heat rate (K/min) 3.3.4.5.6.
Initial hold (min)   5.
Final hold (min)
I 1651.1658.1631.1648.1626.
ReferenceMaia, Zohhbi, et al., 1998Santos, Andrade, et al., 1998Stashenko, Cervantes, et al., 1998Zollo, Biyiti, et al., 1998Salgueiro, Vila, et al., 1997
Comment MSDC-RI MSDC-RI MSDC-RI MSDC-RI MSDC-RI
Column type CapillaryCapillaryCapillaryCapillaryCapillary
Active phase DB-5CBP-1OV-101BP-1HP-1
Column length (m) 30.25.50.25.25.
Carrier gas HeHeHeN2Helium
Substrate
Column diameter (mm) 0.250.220.250.500.32
Phase thickness (μm)     0.25
Tstart (C) 60.60.50.60.60.
Tend (C) 240.240.250.220.220.
Heat rate (K/min) 4.5.2.5.4.
Initial hold (min)     2.
Final hold (min)     20.
I 1654.1639.1634.1644.1632.
ReferenceZunino, Novillo-Newton, et al., 1997Zygadlo, Ariza-Espinar, et al., 1997Orav, Kailas, et al., 1996Rajeswara, Kaul, et al., 1996Thanh, Dung, et al., 1996
Comment MSDC-RI MSDC-RI MSDC-RI MSDC-RI MSDC-RI
Column type CapillaryCapillaryCapillary
Active phase Methyl SiliconeMethyl SiliconeCP Sil 8 CB
Column length (m) 50.50.25.
Carrier gas N2N2
Substrate
Column diameter (mm) 0.250.250.20
Phase thickness (μm) 0.170.17
Tstart (C) 80.80.60.
Tend (C) 200.200.230.
Heat rate (K/min) 3.3.3.
Initial hold (min)   10.
Final hold (min)
I 1632.1639.1657.
ReferenceGopalakrishnan, Menon, et al., 1993Gopalakrishnan, Menon, et al., 1993Jantan and Goh, 1990
Comment MSDC-RI MSDC-RI MSDC-RI

Normal alkane RI, polar column, custom temperature program

Data compiled by: NIST Mass Spectrometry Data Center, William E. Wallace, director

Column type CapillaryCapillaryCapillaryCapillaryCapillary
Active phase HP-InnowaxInnowaxHP InnowaxHP InnowaxHP-Innowax FSC
Column length (m) 60.60.60.50.60.
Carrier gas Helium  HeliumN2
Substrate
Column diameter (mm) 0.250.250.250.200.25
Phase thickness (μm) 0.250.330.330.250.25
Program not specifiednot specifiednot specified40 0C (5 min) 2 0C/min -> 270 0C -> 260 0C (20 min)60C(10min) => 4C/min => 220C(10min) => 1C/min => 240C
I 2235.2255.2255.2255.2255.
ReferenceFeng, Cui, et al., 2011Noorizadeh, Farmany, et al., 2011Noorizadeh and Farmany, 2010Mancini, Arnold, et al., 2009Baser K.H.C. and Demirci B., 2007
Comment MSDC-RI MSDC-RI MSDC-RI MSDC-RI MSDC-RI
Column type CapillaryCapillaryCapillaryCapillaryCapillary
Active phase HP-InnowaxInnowax FSCInnowax FSCInnowax FSCHP-Innowax FSC
Column length (m) 50.60.60.60.60.
Carrier gas HeNitrogenHeHeN2
Substrate
Column diameter (mm) 0.20.250.250.250.25
Phase thickness (μm) 0.20.250.250.250.25
Program 40C(5min) => 2C/min => 250C(15min) => 10C/min => 270C60 0C (10 min) 1 0C/min -> 220 0C (10 min) 1 0C/min -> 240 0C60C(10min) => 4C/min => 220C (10min) => 1C/min => 240C60C(10min) => 4C/min >220C (10min) => 1C/min => 240C60C(10min) => 4C/min => 220C(10min) => 1C/min => 240C
I 2255.2255.2255.2219.2255.
ReferenceFormisano, Mignola, et al., 2007Kaya, Benirci, et al., 2007Tabanca, Demirci, et al., 2007Baser, Özek, et al., 2006Demirci B., Baser K.H.C., et al., 2006
Comment MSDC-RI MSDC-RI MSDC-RI MSDC-RI MSDC-RI
Column type CapillaryCapillaryCapillaryCapillaryCapillary
Active phase HP-Innowax FSCInnowax FSCHP-InnowaxHP-Innowax FSCHP-Innowax
Column length (m) 60.60.50.60.60.
Carrier gas HeN2HeN2N2
Substrate
Column diameter (mm) 0.250.250.20.250.25
Phase thickness (μm) 0.250.250.20.250.25
Program 60C(10min) => 4C/min => 220C (10min) => 1C/min => 240C60C(10min) => 4C/min => 220C(10min) => 1C/min => 240C40C(5min) => 2C/min => 250C (15min) => 10C/min => 270C60C(10min) => 4C/min => 220C => (10min) => 1C/min => 240C60C(10min) => 4C/min => 220C(10min) => 1C/min => 240C
I 2255.2255.2255.2255.2255.
ReferenceErdurak, Coskun, et al., 2006Iscan, Kirimer, et al., 2006Senatore, Apostolides Arnold, et al., 2006Tabanca, Demirci, et al., 2006Duman, Kartal, et al., 2005
Comment MSDC-RI MSDC-RI MSDC-RI MSDC-RI MSDC-RI
Column type CapillaryCapillaryCapillaryCapillaryCapillary
Active phase DB-WaxHP-Innowax FSCHP-Innowax FSCHP-Innowax FSCHP-Innowax FSC
Column length (m)  60.60.60.60.
Carrier gas N2HeN2HeHe
Substrate
Column diameter (mm)  0.250.250.250.25
Phase thickness (μm)  0.250.250.250.25
Program not specified60C(10min) => 4C/min => 220C(10min) => 1C/min => 240C60C(10min) => 4C/min => 220C(10min) => 1C/min => 240C60C(10min) => 4C/min => 220C(10min) => 1C/min => 240C60C(10min) => 4C/min => 220C(10min) => 1C/min => 240C
I 2243.2255.2255.2255.2255.
ReferencePala-Paul, Perez-Alonso, et al., 2005Tabanca, Demirci, et al., 2005Demirci, Paper, et al., 2004Kivcak, Akay, et al., 2004Kivcak, Akay, et al., 2004
Comment MSDC-RI MSDC-RI MSDC-RI MSDC-RI MSDC-RI
Column type CapillaryCapillaryCapillaryCapillaryCapillary
Active phase HP-InnowaxCarbowax 20MHP-Innowax FSCHP-Innowax FSCInnowax
Column length (m) 50. 60.60.60.
Carrier gas   HeHeHe
Substrate
Column diameter (mm) 0.2 0.250.250.25
Phase thickness (μm) 0.2 0.250.250.25
Program not specifiednot specified60C (10min) => 4C/min => 220C (10min) => 1C/min => 240C60C(10min) => 4C/min => 220C(10min) => 1C/min => 240C60C(10min) => 4C/min => 220C(10min) => 1C/min => 240C (20min)
I 2255.2200.2255.2255.2255.
ReferenceSenatore, Apostolides Arnold, et al., 2004Vinogradov, 2004Demirci, Baser, et al., 2003Demirci, Dadandi, et al., 2003Tunaher, Kirimer, et al., 2003
Comment MSDC-RI MSDC-RI MSDC-RI MSDC-RI MSDC-RI
Column type CapillaryCapillaryCapillaryCapillaryCapillary
Active phase HP-InnowaxInnowax FSCHP-Innowax FSCInnowax FSCHP-Innowax
Column length (m) 60.60.60.60.60.
Carrier gas HeHeN2 He
Substrate
Column diameter (mm) 0.250.250.250.250.25
Phase thickness (μm) 0.250.250.250.250.25
Program 60 0C (10 min) 4 K/min -> 220 0C (10 min) 1 K/min -> 240 0C60C(10min) => 4C/min => 220C(10min) => 1C/min => 240C60C(10min) => 4C/min => 220C(10min) => 1C/min => 240C60C(10min) => 4C/min => 220C(10min) => 1C/min => 240C60 0C (10 min) 10 K/min -> 220 0C (10 min) 1K/min -> 240 0C
I 2255.2255.2255.2255.2255.
ReferenceBaser, Demirci, et al., 2002Baser, Demirei, et al., 2002Hüsnü Can Baser, Demirci, et al., 2002Tunalier, Kirimer, et al., 2002Baser, Demirci, et al., 2001
Comment MSDC-RI MSDC-RI MSDC-RI MSDC-RI MSDC-RI
Column type CapillaryCapillaryCapillaryCapillaryCapillary
Active phase HP-InnowaxHP-Innowax FSCInnowaxInnowax FSCHP-Innowax FSC
Column length (m) 60.60.60.60.60.
Carrier gas He HeHe
Substrate
Column diameter (mm) 0.250.250.250.250.25
Phase thickness (μm) 0.250.250.250.250.25
Program 60 0C (10 min) 4 K/min -> 220 0C (10 min) 1 K/min -> 240 0C60C(10min) => 4C/min => 220C(10min) => 1C/min => 240C60C(10min) => 4C/min => 200C(10min) => 1C/min => 240C60C(10min) => 4C/min => 220C(10min) => 1C/min => 240C60C(10min) => 4C/min => 220C(10min) => 1C/min => 240C
I 2255.2255.2255.2255.2255.
ReferenceGören, Demirci, et al., 2001Kaya, Demirci, et al., 2001Özcan, Akgül, et al., 2001Tabanca N., Demirci F., et al., 2001Tabanca, Kirimer, et al., 2001
Comment MSDC-RI MSDC-RI MSDC-RI MSDC-RI MSDC-RI
Column type CapillaryCapillaryCapillaryCapillaryCapillary
Active phase HP-InnowaxInnowaxInnowaxInnowax FSCDB-Wax
Column length (m) 60.60.60.60.60.
Carrier gas HeHeHeHeHelium
Substrate
Column diameter (mm) 0.250.250.250.250.32
Phase thickness (μm) 0.25 0.250.250.25
Program 60C(10min) => 4C/min => 220C(10min) => 1C/min => 240C60 0C (10 min) 4 K/min -> 220 0C (10 min) 1 K/min -> 240 0C60 0C (10 min) 4 K/min -> 220 0C (10 min) 1 K/min -> 240 0C60C(10 min) => 4C/min => 220C(10min) => 1C/min => 240Cnot specified
I 2255.2255.2255.2255.2224.
ReferenceTabanca, Kirimer, et al., 2001, 2Ahmed, Choudhary, et al., 2000Baser, Özek, et al., 2000Kirimer, Tabanca, et al., 2000Paniandy, Chane-Ming, et al., 2000
Comment MSDC-RI MSDC-RI MSDC-RI MSDC-RI MSDC-RI
Column type CapillaryCapillaryCapillaryCapillaryCapillary
Active phase Supelcowax-10Innowax FSCDB-WaxDB-WaxDB-Wax
Column length (m)  60.60.60.60.
Carrier gas  HeliumHeN2N2
Substrate
Column diameter (mm)  0.25
Phase thickness (μm)  0.250.250.250.25
Program not specified60 0C (10 min) 4 0C/min -> 220 0C (10 min) 1 0C/min -> 240 0Cnot specifiednot specifiednot specified
I 2212.2255.2264.2253.2252.
ReferenceZunino, Lopez, et al., 2000Kirimer, Tabanca, et al., 1999Weyerstahl, Marschall, et al., 1999Weyerstahl, Marschall, et al., 1998Weyerstahl, Marschall, et al., 1998, 2
Comment MSDC-RI MSDC-RI MSDC-RI MSDC-RI MSDC-RI

Kovats' RI, polar column, temperature ramp

Data compiled by: NIST Mass Spectrometry Data Center, William E. Wallace, director

Column type CapillaryCapillaryCapillaryCapillaryCapillary
Active phase StabilwaxSupelcowax-10InnowaxCarbowax 20MBP-20
Column length (m) 30.30.30.50.25.
Carrier gas N2 He
Substrate
Column diameter (mm) 0.320.250.250.220.332
Phase thickness (μm) 1.0.250.25
Tstart (C) 50.40.40.80.70.
Tend (C) 220.210.190.200.200.
Heat rate (K/min) 2.2.5.2.4.
Initial hold (min) 3.2.  2.
Final hold (min) 15.33.5.
I 2259.2229.2224.2201.2224.
ReferenceHazzit, Baaliouamer, et al., 2006Sylvestre, Pichette, et al., 2006Mahmood, Kaul, et al., 2004Nishimura, Yamaguchi, et al., 1989Wyllie, Cook, et al., 1987
Comment MSDC-RI MSDC-RI MSDC-RI MSDC-RI MSDC-RI
Column type Capillary
Active phase Carbowax 20M
Column length (m) 50.
Carrier gas He
Substrate
Column diameter (mm) 0.28
Phase thickness (μm)
Tstart (C) 70.
Tend (C) 190.
Heat rate (K/min) 2.
Initial hold (min)
Final hold (min)
I 2205.
ReferenceTressl, Friese, et al., 1978
Comment MSDC-RI

Van Den Dool and Kratz RI, non-polar column, temperature ramp

Data compiled by: NIST Mass Spectrometry Data Center, William E. Wallace, director

Column type CapillaryCapillaryCapillaryCapillaryCapillary
Active phase BP-1HP-5BP-1BP-1DB-5
Column length (m) 50.25.50.50.30.
Carrier gas HeHeHeHeHe
Substrate
Column diameter (mm) 0.220.250.220.220.25
Phase thickness (μm) 0.250.250.250.250.25
Tstart (C) 60.60.60.60.60.
Tend (C) 220.240.220.220.240.
Heat rate (K/min) 2.4.2.2.3.
Initial hold (min)  2.
Final hold (min) 20. 20.20.
I 1641.1658.1637.1640.1653.
ReferenceBoti, Koukoua, et al., 2007Dehghan, Solaimanian, et al., 2007Duquesnoy, Castola, et al., 2007Lesueur, de Rocca Serra, et al., 2007Maccioni, Baldini, et al., 2007
Comment MSDC-RI MSDC-RI MSDC-RI MSDC-RI MSDC-RI
Column type CapillaryCapillaryCapillaryCapillaryCapillary
Active phase DB-5Methyl SiliconeRTX-1RTX-1HP-101
Column length (m) 30.30.60.60.25.
Carrier gas  HeHeHeHe
Substrate
Column diameter (mm) 0.220.250.220.220.2
Phase thickness (μm) 0.250.250.250.250.2
Tstart (C) 60.80.60.60.70.
Tend (C) 240.220.230.230.200.
Heat rate (K/min) 3.2.2.2.3.
Initial hold (min) 2.   2.
Final hold (min)  15.35.35.15.
I 1654.1650.1643.1643.1614.
ReferenceMartins, Santos, et al., 2007Melo, Corrêa, et al., 2007Paolini J., Costa J., et al., 2007Paolini, Muselli, et al., 2007Politeo, Jukic, et al., 2007
Comment MSDC-RI MSDC-RI MSDC-RI MSDC-RI MSDC-RI
Column type CapillaryCapillaryCapillaryCapillaryCapillary
Active phase SPB-1HP-5MSDB-5HP-5MSDB-1
Column length (m) 30.30.25.30.60.
Carrier gas HeHeHeHeN2
Substrate
Column diameter (mm) 0.250.250.250.250.25
Phase thickness (μm) 0.250.250.250.250.25
Tstart (C) 50.60.60.60.60.
Tend (C) 250.280.200.280.250.
Heat rate (K/min) 5.4.2.4.5.
Initial hold (min) 3.5. 5.
Final hold (min) 15. 60. 10.
I 1653.1656.1655.1656.1648.
ReferenceRadulovic, Lazarevic, et al., 2007Radulovic, Lazarevic, et al., 2007Rout, Rao, et al., 2007Saroglou, Marin, et al., 2007Sonboli, Azizian, et al., 2007
Comment MSDC-RI MSDC-RI MSDC-RI MSDC-RI MSDC-RI
Column type CapillaryCapillaryCapillaryCapillaryCapillary
Active phase DB-5HP-5MSDB-5HP-5MSHP-5MS
Column length (m) 30.30.30.30.30.
Carrier gas HeHeHeHeHe
Substrate
Column diameter (mm) 0.250.250.250.250.25
Phase thickness (μm) 0.250.250.250.250.25
Tstart (C) 60.60.50.80.60.
Tend (C) 240.280.250.300.280.
Heat rate (K/min) 3.3.3.4.3.
Initial hold (min)
Final hold (min)   10.
I 1653.1656.1651.1652.1630.
ReferenceTelascrea, de Araujo, et al., 2007Vagionas, Ngassapa, et al., 2007Yu, Liao, et al., 2007Zeng, Zhao, et al., 2007Basta, Tzakou, et al., 2006
Comment MSDC-RI MSDC-RI MSDC-RI MSDC-RI MSDC-RI
Column type CapillaryCapillaryCapillaryCapillaryCapillary
Active phase BP-1BP-1DB-5BP-1HP-5
Column length (m) 50.50.30.50.30.
Carrier gas  HeN2HeN2
Substrate
Column diameter (mm) 0.220.220.320.220.25
Phase thickness (μm) 0.250.250.250.250.25
Tstart (C) 60.60.60.60.60.
Tend (C) 220.220.240.220.220.
Heat rate (K/min) 2.2.3.2.5.
Initial hold (min)   3. 10.
Final hold (min) 20.20.5.20.
I 1641.1631.1657.1641.1659.
ReferenceBlanc, Bradesi, et al., 2006Boti, Bighelli, et al., 2006Dob, Dahmane, et al., 2006Duquesnoy, Dinh, et al., 2006Flamini, Tebano, et al., 2006
Comment MSDC-RI MSDC-RI MSDC-RI MSDC-RI MSDC-RI
Column type CapillaryCapillaryCapillaryCapillaryCapillary
Active phase BP-1HP-5HP-5DB-1HP-5MS
Column length (m) 50.30.30.30.30.
Carrier gas HeHeHeN2He
Substrate
Column diameter (mm) 0.220.250.250.250.25
Phase thickness (μm) 0.250.250.250.250.25
Tstart (C) 60.60.60.50.60.
Tend (C) 220.250.260.220.280.
Heat rate (K/min) 2.3.3.4.3.
Initial hold (min)
Final hold (min) 20.
I 1642.1655.1655.1657.1653.
ReferenceGonny, Cavaleiro, et al., 2006Javidnia, Miri, et al., 2006Javidnia K., Miri R., et al., 2006Kuiate, Bessière, et al., 2006Kukic J., Petrovic S., et al., 2006
Comment MSDC-RI MSDC-RI MSDC-RI MSDC-RI MSDC-RI
Column type CapillaryCapillaryCapillaryCapillaryCapillary
Active phase HP-5DB-5HP-5MSDB-5SPB-1
Column length (m) 30.50.30.30.30.
Carrier gas HeN2HeHeHe
Substrate
Column diameter (mm) 0.250.20.250.320.2
Phase thickness (μm) 0.250.320.250.250.2
Tstart (C) 60.60.60.60.70.
Tend (C) 250.220.280.280.220.
Heat rate (K/min) 10.5.3.3.3.
Initial hold (min) 2.3.
Final hold (min) 10.5.  15.
I 1646.1653.1624.1640.1628.
ReferenceLiu J.M., Nan P., et al., 2006Masoudi, Esmaeili, et al., 2006Pavlovic, Kovacevic, et al., 2006Pavlovic, Tzakou, et al., 2006Pinto, Pina-Vaz, et al., 2006
Comment MSDC-RI MSDC-RI MSDC-RI MSDC-RI MSDC-RI
Column type CapillaryCapillaryCapillaryCapillaryCapillary
Active phase DB-1HP-5OV-1SPB-1HP-5MS
Column length (m) 30.25.25.30.30.
Carrier gas HeHeHeHeHe
Substrate
Column diameter (mm) 0.250.250.250.20.25
Phase thickness (μm) 0.250.250.250.20.25
Tstart (C) 60.60.50.70.60.
Tend (C) 240.240.220.220.280.
Heat rate (K/min) 4.4.3.3.4.
Initial hold (min)   1. 5.
Final hold (min)   5.15.
I 1659.1660.1656.1628.1652.
ReferenceRezazadeh, Hamedani, et al., 2006Rezazadeh, Hamedani, et al., 2006Rubiolo P., Matteodo M., et al., 2006Salgueiro L.R., Pinto E., et al., 2006Saroglou, Dorizas, et al., 2006
Comment MSDC-RI MSDC-RI MSDC-RI MSDC-RI MSDC-RI
Column type CapillaryCapillaryCapillaryCapillaryCapillary
Active phase HP-5MSDB-5DB-5HP-5MSHP-5
Column length (m) 30.30.30.30.30.
Carrier gas HeHeHeH2He
Substrate
Column diameter (mm) 0.250.250.250.250.25
Phase thickness (μm) 0.250.250.250.250.25
Tstart (C) 60.50.50.50.40.
Tend (C) 280.250.250.285.300.
Heat rate (K/min) 4.5.5.4.34.
Initial hold (min) 5.2.2. 5.
Final hold (min)
I 1670.1654.1654.1660.1642.
ReferenceSaroglou, Dorizas, et al., 2006Su, Ho, et al., 2006Su, Ho, et al., 2006, 2Vujisic L., Vuckovic I., et al., 2006Vundac, Pfeifhofer, et al., 2006
Comment MSDC-RI MSDC-RI MSDC-RI MSDC-RI MSDC-RI
Column type CapillaryCapillaryCapillaryCapillaryCapillary
Active phase HP-5DB-1DB-1BP-1HP-5
Column length (m) 30.30.30.50.30.
Carrier gas N2N2HeHeN2
Substrate
Column diameter (mm) 0.250.320.250.220.25
Phase thickness (μm) 0.250.250.250.250.25
Tstart (C) 60.50.40.60.60.
Tend (C) 220.260.260.220.220.
Heat rate (K/min) 5.2.2.2.5.
Initial hold (min) 10.3.5. 10.
Final hold (min)  5.20.20.
I 1656.1631.1603.1641.1656.
ReferenceCelik, Gokturk, et al., 2005Dob, Berramdane, et al., 2005de Feo, Urrunaga Soria, et al., 2005Ferrari, Tomi, et al., 2005Flamini, Luigi Cioni, et al., 2005
Comment MSDC-RI MSDC-RI MSDC-RI MSDC-RI MSDC-RI
Column type CapillaryCapillaryCapillaryCapillaryCapillary
Active phase CP Sil 5 CBDB-5HP-5RTX-1HP-5MS
Column length (m) 50.25.30.60.30.
Carrier gas H2N2HeHeHe
Substrate
Column diameter (mm) 0.220.250.250.220.25
Phase thickness (μm) 0.130.250.250.250.25
Tstart (C) 40.75.60.60.60.
Tend (C) 300.210.260.230.250.
Heat rate (K/min) 4.3.3.2.4.
Initial hold (min)  10.  2.
Final hold (min) 10.1. 35.20.
I 1618.1652.1655.1643.1653.
ReferenceIdzojtic, Kajba, et al., 2005bin Jantan, Yalvema, et al., 2005Javidnia, Miri, et al., 2005Paolini, Costa, et al., 2005Pino, Mesa, et al., 2005
Comment MSDC-RI MSDC-RI MSDC-RI MSDC-RI MSDC-RI
Column type CapillaryCapillaryCapillaryCapillaryCapillary
Active phase DB-5DB-5MSDB-1BP-1HP-5MS
Column length (m) 30.60.30.50.30.
Carrier gas HeHeN2HeHe
Substrate
Column diameter (mm) 0.250.250.250.220.25
Phase thickness (μm) 0.250.250.250.250.25
Tstart (C) 40.40.50.60.80.
Tend (C) 260.200.200.230.290.
Heat rate (K/min) 2.2.5.2.2.
Initial hold (min) 5.
Final hold (min) 20.20. 35.
I 1653.1659.1645.1643.1651.1
ReferenceSenatore, Napolitano, et al., 2005Seo and Baek, 2005Tchoumbougnang, Zollo, et al., 2005Vellutini, Baldovini, et al., 2005Zhao, Liang, et al., 2005
Comment MSDC-RI MSDC-RI MSDC-RI MSDC-RI MSDC-RI
Column type CapillaryCapillaryCapillaryCapillaryCapillary
Active phase HP-5MSHP-5MSDB-5HP-5MSSPB-1
Column length (m) 30.30.30.30.30.
Carrier gas HeHeHeHeHe
Substrate
Column diameter (mm) 0.250.250.260.250.25
Phase thickness (μm) 0.250.250.250.250.25
Tstart (C) 80.80.60.60.70.
Tend (C) 290.290.246.280.220.
Heat rate (K/min) 4.6.3.3.3.
Initial hold (min)
Final hold (min)     15.
I 1659.21665.41653.1651.1628.
ReferenceZhao, Liang, et al., 2005Zhao, Liang, et al., 2005Adams, Habte, et al., 2004Aligiannis, Kalpoutzakis, et al., 2004Antunes, Sevinate-Pinto, et al., 2004
Comment MSDC-RI MSDC-RI MSDC-RI MSDC-RI MSDC-RI
Column type CapillaryCapillaryCapillaryCapillaryCapillary
Active phase HP-5HP-5SPB-1DB-5HP-5
Column length (m) 30.30.30.30.30.
Carrier gas N2N2HeN2N2
Substrate
Column diameter (mm) 0.250.250.20.250.25
Phase thickness (μm) 0.250.250.20.250.25
Tstart (C) 60.60.70.60.60.
Tend (C) 220.220.220.240.220.
Heat rate (K/min) 5.5.3.3.5.
Initial hold (min) 10.10.  10.
Final hold (min)   15.
I 1652.1652.1628.1654.1653.
ReferenceBertoli, Menichini, et al., 2004Bertoli, Pistelli, et al., 2004Cavaleiro, Salgueiro, et al., 2004Flamini, Cioni, et al., 2004Flamini, Luigi Cioni, et al., 2004
Comment MSDC-RI MSDC-RI MSDC-RI MSDC-RI MSDC-RI
Column type CapillaryCapillaryCapillaryCapillaryCapillary
Active phase BP-1HP-5MSHP-5HP-5HP-5MS
Column length (m) 50.30.30.30.30.
Carrier gas  HeHeHeHe
Substrate
Column diameter (mm) 0.220.250.250.250.25
Phase thickness (μm) 0.250.250.25 0.25
Tstart (C) 60.60.60.60.60.
Tend (C) 220.280.260.260.280.
Heat rate (K/min) 2.4.3.3.4.
Initial hold (min)  5.  5.
Final hold (min) 20.
I 1638.1656.1655.1655.1650.
ReferenceGonny, Bradesi, et al., 2004Grujic-Jovanovic, Skaltsa, et al., 2004Javidnia, Miri, et al., 2004Javidnia, Miri, et al., 2004, 2Karioti, Hadjipavlou-Litina, et al., 2004
Comment MSDC-RI MSDC-RI MSDC-RI MSDC-RI MSDC-RI
Column type CapillaryCapillaryCapillaryCapillaryCapillary
Active phase DB-5MSRSL-200BP-1DB-5HP-5
Column length (m) 30.30.30.30.25.
Carrier gas HeH2N2HeHe
Substrate
Column diameter (mm) 0.250.320.320.250.2
Phase thickness (μm) 0.250.250.250.250.33
Tstart (C) 40.40.60.50.60.
Tend (C) 280.280.220.290.240.
Heat rate (K/min) 4.6.5.4.3.
Initial hold (min) 2.5.
Final hold (min)  5.13. 7.
I 1666.1679.1658.1645.1656.
ReferenceMardarowicz, Wianowska, et al., 2004Ngassoum, Ousmaila, et al., 2004Raina, Kumar, et al., 2004Reis, Pansarim, et al., 2004Sartoratto, Machado, et al., 2004
Comment MSDC-RI MSDC-RI MSDC-RI MSDC-RI MSDC-RI
Column type CapillaryCapillaryCapillaryCapillaryCapillary
Active phase HP-5MSDB-5MSDB-5MSDB-5BP-1
Column length (m) 30.30.30.30.50.
Carrier gas HeHeHeHeHe
Substrate
Column diameter (mm) 0.250.250.250.250.22
Phase thickness (μm) 0.250.250.250.250.25
Tstart (C) 60.40.40.60.60.
Tend (C) 280.200.200.240.230.
Heat rate (K/min) 3.4.4.3.2.
Initial hold (min)  5.5.
Final hold (min)  20.20.30.35.
I 1635.1664.1657.1655.1653.
ReferenceTzakou, Vagias, et al., 2004Yu, Kim, et al., 2004Yu, Kim, et al., 2004, 2Bader, Caponi, et al., 2003Bianchini, Tomi, et al., 2003
Comment MSDC-RI MSDC-RI MSDC-RI MSDC-RI MSDC-RI
Column type CapillaryCapillaryCapillaryCapillaryCapillary
Active phase DB-1HP-5SPB-1RTX-1HP-5
Column length (m) 30.30.30.60.30.
Carrier gas N2N2HeHeN2
Substrate
Column diameter (mm) 0.250.250.20.220.25
Phase thickness (μm) 0.250.250.20.250.25
Tstart (C) 50.60.70.60.60.
Tend (C) 200.220.220.230.220.
Heat rate (K/min) 5.5.3.2.5.
Initial hold (min)  10.  10.
Final hold (min) 0. 15.45.
I 1638.1619.1628.1639.1656.
ReferenceBoyom, Assembe, et al., 2003Campeol, Flamini, et al., 2003Cavaleiro, Salgueiro, et al., 2003Cavalli, Tomi, et al., 2003Dural, Bagci, et al., 2003
Comment MSDC-RI MSDC-RI MSDC-RI MSDC-RI MSDC-RI
Column type CapillaryCapillaryCapillaryCapillaryCapillary
Active phase HP-5DB-1HP-5HP-5DB-5
Column length (m) 30.30.30.30.25.
Carrier gas N2HeHe He
Substrate
Column diameter (mm) 0.250.250.250.250.25
Phase thickness (μm) 0.250.250.25
Tstart (C) 60.40.60.25.60.
Tend (C) 220.250.280.150.260.
Heat rate (K/min) 5.2.3.3.4.
Initial hold (min) 10.5. 5.
Final hold (min)  20.
I 1655.1618.1653.1654.1656.
ReferenceErtugrul, Dural, et al., 2003de Feo, Bruno, et al., 2003Fokialakis, Melliou, et al., 2003Isidorov, Vinogorova, et al., 2003Javidnia, Miri, et al., 2003
Comment MSDC-RI MSDC-RI MSDC-RI MSDC-RI MSDC-RI
Column type CapillaryCapillaryCapillaryCapillaryCapillary
Active phase HP-5HP-1HP-5SPB-1HP-5MS
Column length (m) 30.30.30.30.30.
Carrier gas HeHeHeHe
Substrate
Column diameter (mm) 0.250.250.250.200.25
Phase thickness (μm) 0.250.330.250.200.25
Tstart (C) 60.40.60.70.50.
Tend (C) 280.260.280.220.280.
Heat rate (K/min) 3.2.4.3.3.
Initial hold (min)  5.5. 5.
Final hold (min)  20. 15.
I 1653.1655.1656.1627.1653.
ReferenceNgassapa, Runyoro, et al., 2003Senatore, Rigano, et al., 2003Skaltsa, Demetzos, et al., 2003Cavaleiro, Salgueiro, et al., 2002Demetzos, Angelopoulou, et al., 2002
Comment MSDC-RI MSDC-RI MSDC-RI MSDC-RI MSDC-RI
Column type CapillaryCapillaryCapillaryCapillaryCapillary
Active phase HP-5RTX-5 MSDB-5HP-5DB-5
Column length (m) 30.30.30.30.25.
Carrier gas  HeHeHeHe
Substrate
Column diameter (mm) 0.250.250.250.250.25
Phase thickness (μm) 0.250.250.250.25
Tstart (C) 60.45.60.60.70.
Tend (C) 280.180.260.280.260.
Heat rate (K/min) 3.2.54.3.4.
Initial hold (min) 5.10.
Final hold (min)
I 1654.1653.1653.1647.1653.
ReferenceFokialakis, Magiatis, et al., 2002Hudaib, Speroni, et al., 2002Javidnia, Miri, et al., 2002Kovacevic, Pavlovic, et al., 2002Miri, Ramezani, et al., 2002
Comment MSDC-RI MSDC-RI MSDC-RI MSDC-RI MSDC-RI
Column type CapillaryCapillaryCapillaryCapillaryCapillary
Active phase HP-1CP Sil 5 CBCP Sil 5 CBRTX-5RTX-5
Column length (m) 24.25.30.30.30.
Carrier gas HeN2H2HeHe
Substrate
Column diameter (mm) 0.320.250.250.250.25
Phase thickness (μm) 0.170.250.250.250.25
Tstart (C) 60.60.60.45.45.
Tend (C) 250.280.280.250.250.
Heat rate (K/min) 4.4.2.3.3.
Initial hold (min) 2.6.10.6.6.
Final hold (min) 20. 40.
I 1632.1642.1642.1653.1662.
ReferenceNath, Sarma, et al., 2002Pino, Marbot, et al., 2002Pino, Marbot, et al., 2002, 2Shellie, Mondello, et al., 2002Shellie, Mondello, et al., 2002
Comment MSDC-RI MSDC-RI MSDC-RI MSDC-RI MSDC-RI
Column type CapillaryCapillaryCapillaryCapillaryCapillary
Active phase HP-5HP-5DB-5CP Sil 5 CBBP-1
Column length (m) 30.30.30.50.50.
Carrier gas HeHeH2HeHe
Substrate
Column diameter (mm) 0.250.250.250.320.22
Phase thickness (μm) 0.250.250.250.40.25
Tstart (C) 60.60.60.60.60.
Tend (C) 280.260.240.280.220.
Heat rate (K/min) 3.3.3.3.2.
Initial hold (min) 5.  10.
Final hold (min)  10. 60.20.
I 1652.1654.1656.1628.1642.
ReferenceAligiannis, Kalpoutzakis, et al., 2001Couladis, Baziou, et al., 2001Nogueira, Bittrich, et al., 2001Pino, Marbot, et al., 2001Rezzi, Bighelli, et al., 2001
Comment MSDC-RI MSDC-RI MSDC-RI MSDC-RI MSDC-RI
Column type CapillaryCapillaryCapillaryCapillaryCapillary
Active phase BP-1HP-5MSHP-5HP-5HP-5
Column length (m) 50.30.30.30.30.
Carrier gas  HeHeHeHe
Substrate
Column diameter (mm) 0.220.250.200.250.25
Phase thickness (μm) 0.250.250.250.250.25
Tstart (C) 60.60.60.40.50.
Tend (C) 220.280.180.200.280.
Heat rate (K/min) 2.4.4.2.4.
Initial hold (min)  5.8.5.5.
Final hold (min) 20. 2.20.
I 1640.1656.1653.1646.1654.
ReferenceRezzi, Cavaleiro, et al., 2001Skaltsa, Mavrommati, et al., 2001Alonzo, Bosco, et al., 2000Kim, Thuy, et al., 2000Lazari, Skaltsa, et al., 2000
Comment MSDC-RI MSDC-RI MSDC-RI MSDC-RI MSDC-RI
Column type CapillaryCapillaryCapillaryCapillaryCapillary
Active phase HP-5DB-5DB-5OV-101CP Sil 5 CB
Column length (m) 30.30.30.25.50.
Carrier gas HeHeHeN2H2
Substrate
Column diameter (mm) 0.250.250.250.250.22
Phase thickness (μm) 0.250.250.25 0.13
Tstart (C) 50.60.60.50.40.
Tend (C) 280.240.240.200.300.
Heat rate (K/min) 4.3.3.5.4.
Initial hold (min) 5.2.2.
Final hold (min)     10.
I 1654.1653.1653.1649.1636.
ReferenceLazari, Skaltsa, et al., 2000, 2Maia, de Paula, et al., 2000Maia, de Paula, et al., 2000Menut, Bessiere, et al., 2000Pfeifhofer, 2000
Comment MSDC-RI MSDC-RI MSDC-RI MSDC-RI MSDC-RI
Column type CapillaryCapillaryCapillaryCapillaryCapillary
Active phase HP-5CBP-1DB-1HP-1Methyl Silicone
Column length (m) 30.30.30.60.50.
Carrier gas HeHe HeN2
Substrate
Column diameter (mm) 0.250.250.250.250.25
Phase thickness (μm) 0.25 0.250.250.17
Tstart (C) 50.60.50.50.80.
Tend (C) 280.240.220.250.200.
Heat rate (K/min) 4.4.3.2.52.
Initial hold (min) 5. 3.5.
Final hold (min)
I 1655.1653.1617.1631.1638.
ReferenceSkaltsa, Lazari, et al., 2000Zunino, Lopez, et al., 2000Muselli, Hoi, et al., 1999Stashenko, Cervantes, et al., 1999Sumathykutty, Rao, et al., 1999
Comment MSDC-RI MSDC-RI MSDC-RI MSDC-RI MSDC-RI
Column type CapillaryCapillaryCapillaryCapillaryCapillary
Active phase CP Sil 5 CBOV-1DB-5DB-5BP-1
Column length (m) 25.25.30.30.25.
Carrier gas He  H2He
Substrate
Column diameter (mm) 0.250.250.250.250.32
Phase thickness (μm)  0.30.250.25
Tstart (C) 60.50.50.60.5.
Tend (C) 260.200.250.240.250.
Heat rate (K/min) 5.3.3.3.5.
Initial hold (min)  1.  5.
Final hold (min)  20.  30.
I 1642.1618.1654.1655.1664.
ReferenceWeyerstahl, Marschall, et al., 1999Bicchi, Rubiolo, et al., 1998Isidorov, Zenkevich, et al., 1998Nogueira, Marsaioli, et al., 1998Sinyinda and Gramshaw, 1998
Comment MSDC-RI MSDC-RI MSDC-RI MSDC-RI MSDC-RI
Column type CapillaryCapillaryCapillaryCapillaryCapillary
Active phase BP-1OV-1BP-1DB-5DB-1
Column length (m) 50.25.50.30.60.
Carrier gas HeH2HeHeHe
Substrate
Column diameter (mm) 0.220.250.220.260.25
Phase thickness (μm) 0.250.30.250.250.25
Tstart (C) 60.50.60.50.50.
Tend (C) 220.200.230.225.250.
Heat rate (K/min) 2.3.2.2.3.5
Initial hold (min)  1.  5.
Final hold (min) 20.20.35.20.
I 1647.1618.1656.1612.1630.
ReferenceTam, An, et al., 1998Bicchi, Fresia, et al., 1997Mariotti, Costa, et al., 1997Sagrero-Nieves, Bartley, et al., 1997Stashenko, Prada, et al., 1996
Comment MSDC-RI MSDC-RI MSDC-RI MSDC-RI MSDC-RI
Column type CapillaryCapillary
Active phase HP-101DB-5
Column length (m) 50.60.
Carrier gas N2He
Substrate
Column diameter (mm) 0.250.32
Phase thickness (μm)  1.
Tstart (C) 70.40.
Tend (C) 200.220.
Heat rate (K/min) 3.3.
Initial hold (min)
Final hold (min)
I 1674.1676.
ReferenceChung, Eiserich, et al., 1993Le Quere and Latrasse, 1990
Comment MSDC-RI MSDC-RI

Van Den Dool and Kratz RI, polar column, custom temperature program

Data compiled by: NIST Mass Spectrometry Data Center, William E. Wallace, director

Column type CapillaryCapillaryCapillary
Active phase Carbowax 20MBP-20HP-Innowax
Column length (m) 25. 30.
Carrier gas H2 He
Substrate
Column diameter (mm) 0.32 0.25
Phase thickness (μm) 0.25 0.25
Program 40 0C (8 min) 3 K/min -> 180 0C 20 K/min -> 230 0Cnot specified60C(8min) => 3C/min => 180C(5min) => 40C/min => 250C
I 2219.2221.2230.
ReferenceLorenzo, Saavedra, et al., 2001Filippini, Tomi, et al., 2000Bisio, Ciarallo, et al., 1998
Comment MSDC-RI MSDC-RI MSDC-RI

References

Pinheiro, de Queiros, et al., 2013
Pinheiro, P.F.; de Queiros, V.T.; Rondelli, V.M.; Costa, A.V.; MArcelino, T. deP.; Pratissoli, D., Insecticidal activity of citronells grass essential oil on Frankliniella schultzei and Myzus persicae, Cienc. Agrotec. Lavras, 2013, 37, 2, 138-144, https://doi.org/10.1590/S1413-70542013000200004 . [all data]

Bendiabdellah, El Amine Dib, et al., 2012
Bendiabdellah, A.; El Amine Dib, M.; Djabou, N.; Allali, H.; Tabti, B.; Costa, J.; Myseli, A., Biological activities and volatile cinstituents of Daucus muricatus L. from Algeria, Chem. Centr. J., 2012, 6, 48, 1-22. [all data]

Phungpanya, Thongpoon, et al., 2012
Phungpanya, C.; Thongpoon, C.; Pripdeevech, P.; Machan, T., Analysis of aroma volatiles from fresh leaves of Plectranthus amboinicus using solid phase microextraction (SPME) technique, Pure and Applied Chemistry International Conference 2012 (PACCON 2012), 2012, 16701672. [all data]

Yapi, Boti, et al., 2012
Yapi, T.A.; Boti, J.B.; Attioua, B.K.; Ahibo, A.C.; Bighelli, A.; Casanova, J.; Tomi, F., Three new natural compounds from the root bark essential oil from Xylopia aethiopica, Phytochem. Anal., 2012, 1-6. [all data]

Zouari, Ayadi, et al., 2012
Zouari, N.; Ayadi, I.; Fakhfakh, N.; Rebai, A.; Zouari, S., Variations of chemical composition of essential oils in wild-populations of Thymus algeriensis Boiss et Reut., a North African endemic species, Lipids in Health and Desease, 2012, 11, 1, 28-39, https://doi.org/10.1186/1476-511X-11-28 . [all data]

Bertoli, Lepnardi, et al., 2011
Bertoli, A.; Lepnardi, M.; Krzyzanowska, J.; Oleszek, W.; Pistelli, L., Mentha longifolia in vitro cultures as safe source of flavouring ingradients, Acta Biochem. Polonica, 2011, 58, 4, 581-587. [all data]

Feizbakhsh and Naeemy, 2011
Feizbakhsh, A.; Naeemy, A., Volatile constituents of essential oils of Eleocharis pauciflora (Light) Link and Eleocharis uniglumis (Link) J.A. Schultes growing wild in Iran, Bull. Chem. Soc. Ethiop., 2011, 25, 3, 461-464, https://doi.org/10.4314/bcse.v25i3.68606 . [all data]

Hammami, Kamoun, et al., 2011
Hammami, I.; Kamoun, N.; Rebai, A., Biocontrol of Botrytis cinerea with essential oil and methanol extract of Viola odorata flowers, Archives of Appl. Sci. Res., 2011, 3, 5, 44-51. [all data]

Karimi, Farmani, et al., 2011
Karimi, H.; Farmani, A.; Nourizadeh, H., A performance comparison of modern statistical technique for molecular descriptor selection and retention prediction of essential oil from leaves, Amer. J. Sci. Res., 2011, 38, 36-40. [all data]

Vazquez, Demmel, et al., 2011
Vazquez, A.M.; Demmel, G.I.; Criado, S.G.; Aimar, M.L.; Cantero, J.; Rossi, L.I.; Velasco, M.I., Phytochemistry of TAgetes minuta L. (Asteraceae) from Cordoba, Argentina: comparative study between essential oil and HS-SPME analyses, Boletin Latinoamericano y del Caribe Plantas Medicinales y Aromaticas, 2011, 10, 4, 351-362. [all data]

Bi Kouame, Bedi, et al., 2010
Bi Kouame, F.P.; Bedi, G.; Koffi, A.M.; Chalchat, J.C.; Guessan, T.Y.N., Volatile constituents from leaves of Morinda morindoides (Rubiaceae): a medicinal plant from the Ivory Coast, The Open Nat. Prod. J., 2010, 3, 1, 6-9, https://doi.org/10.2174/1874848101003010006 . [all data]

Cavar, Maksimovic, et al., 2010
Cavar, S.; Maksimovic, M.; Solic, M.E., Comparison of essential oil composition of Stachys menthufolia Vis. from two natural habitas in Croatia, Biologica Nyssana, 2010, 1, 1-2, 99-103. [all data]

Kahriman, Tosun, et al., 2010
Kahriman, N.; Tosun, G.; Genc, H.; Yayli, N., Comparative essential oil analysis of Geranium sylvaticum estracted by hydrodistillation and microwave distillation, Turk. J. Chem., 2010, 34, 969-976. [all data]

Lazarevic, Palic, et al., 2010
Lazarevic, J.S.; Palic, R.V.M.; Radulovic, N.S.; Ristic, N.R.; Stojanovic, G.S., Chemical composition and screening of the antimicrobial and antioxidative acrivity of extracts of Stachys species, J. Serb. Chem. Soc., 2010, 75, 10, 1347-1359, https://doi.org/10.2298/JSC100601117L . [all data]

Mesa-Arango, Betancur-Galvis, et al., 2010
Mesa-Arango, A.C.; Betancur-Galvis, L.; Montiel, J.; Bueno, J.G.; Baena, A.; Duran, D.C.; Martinez, J.R.; Stashenko, E.E., Antifungal activity and chemical composition of the essential oils of Lippia alba (Miller) N.E. Brown grown in different regions of Colombia, J. Essential Oil Res., 2010, 22, 6, 568-574, https://doi.org/10.1080/10412905.2010.9700402 . [all data]

Mishra, Chaudhary, et al., 2010
Mishra, R.K.; Chaudhary, S.; Pandey, R.; Gupta, S.; Mallavarapu, G.R.; Kumar, S., Analysis of linalool content in the inflorescence (flower) essential oil and leaf oil of Lippia alba cultivar Kavach, J. Essen. Oil Res., 2010, 22, 1, 3-7, https://doi.org/10.1080/10412905.2010.9700253 . [all data]

Miyazawa, Kawauchi, et al., 2010
Miyazawa, M.; Kawauchi, Y.; Utsumi, Y.; Takahashi, T., Character impact odorants of wild edible plant - Cacalia hastata L. var. orientalis - used in Japanese traditional food, J. Oleo Sci., 2010, 59, 10, 527-533, https://doi.org/10.5650/jos.59.527 . [all data]

Monsef-Esfahani, Miri, et al., 2010
Monsef-Esfahani, H.R.; Miri, A.; Amini, M.; Amanzadeh, Y.; Hadjiakhoondi, A.; Hajiaghaee, R.; Ajani, Y., Seasonal variations in the chemical composition, antioxidant activity and total phenolic content of Teucrium persicum Boiss. essential oils, Res. J. Biol. Sci., 2010, 5, 7, 492-498, https://doi.org/10.3923/rjbsci.2010.492.498 . [all data]

Neves, Rosa, et al., 2010
Neves, A.; Rosa, S.; Goncalves, J.; Rufino, A.; Judas, F.; Salgueiro, L.; Lopes, M.C.; Cavaleiro, C.; Mendes, A.F., Screening of five essential oils for identification of potential inhibitors of IL-1-unduced Nf-kB activation and NO production in human clondrocytes: characterization of the inhibitory activity of alpha-pinene, Plante Med., 2010, 76, 03, 303-308, https://doi.org/10.1055/s-0029-1186085 . [all data]

Ogunwande, Flamini, et al., 2010
Ogunwande, I.A.; Flamini, G.; Cioni, P.L.; Omikorede, O.; Azeez, R.A.; Ayodele, A.A.; Kamil, Y.O., Aromatic plants growing in Nigeria: essential oil constituents of Cassia alata (Linn.) Roxb. and Helianthus annuus L., Rec. Nat. Prod., 2010, 4, 4, 211-217. [all data]

Pripdeevech, Chumpolsri, et al., 2010
Pripdeevech, P.; Chumpolsri, W.; Suttiarporn, P.; Wongpornchai, S., The chemical composition and antioxidant activities of Basil from Thailand using retention indices and comprehensive two-dimensional gas chromatography, J. Seb. Chem. Soc., 2010, 75, 11, 1503-1513, https://doi.org/10.2298/JSC100203125P . [all data]

Radulovic, Blagojevic, et al., 2010
Radulovic, N.; Blagojevic, P.; Palic, R., Comparative study of the leaf volatiles of Arctostaphylos uva-ursi (L.) Spreng. and Vaccinium vitis-idaea L. (Ericaceae), Molecules, 2010, 15, 9, 6168-6185, https://doi.org/10.3390/molecules15096168 . [all data]

Radulovic, Dordevic, et al., 2010
Radulovic, N.S.; Dordevic, N.D.; Palic, R.M., Volatiles of Pleurospermum austriacum (L.) Hoffm. (Apiaceae), J. Serbian Chem. Soc., 2010, 75, 12, 1-11, https://doi.org/10.2298/JSC100323127R . [all data]

Radulovic, Dordevic, et al., 2010, 2
Radulovic, N.; Dordevic, N.; Markovic, M.; Palic, R., Volatile constituents of Glechoma Hirsuta Waldst. Kit. and G. Hederacea L. (Lamiaceae), Bull. Chem. Soc. Ethiop., 2010, 24, 1, 67-76, https://doi.org/10.4314/bcse.v24i1.52962 . [all data]

Safaei-Ghomi and Batooli, 2010
Safaei-Ghomi, J.; Batooli, H., Determination of bioactive molecules from flowers, leaves, stems and roots of Perovskia abrotanoides Karel growing in central Iran by nano scale injection, Digest J. Nanomaterials Biostructures, 2010, 5, 2, 551-556. [all data]

Xu, Tang, et al., 2010
Xu, X.; Tang, Z.; Liang, Y., Comparative analysis of plant essential oils by GC-MS coupled with integrated chemometric resolution methods, Anal. Methods, 2010, 2, 4, 359-367, https://doi.org/10.1039/b9ay00213h . [all data]

Zouari, Zouari, et al., 2010
Zouari, S.; Zouari, N.; Fakhfakh, N.; Bougatel, A.; Ayadi, M.A.; Neffati, M., Chemical composition and biological activities of a new essential oil chemotype of Tunisian Artemisia herba alba Asso, J. Medicinal Plants Res., 2010, 4, 10, 871-880. [all data]

Benites, Moiteiro, et al., 2009
Benites, J.; Moiteiro, C.; Miguel, G.; Rojo, L.; Lopez, J.; Venancio, F.; Ramalho, L.; Feio, S.; Dandlen, S.; Casanova, H.; Torres, I., Composition and biological activity of the essential oil of Peruvial Lantana camara, J. Chilean Chem. Soc., 2009, 54, 4, 379-384, https://doi.org/10.4067/S0717-97072009000400012 . [all data]

Dayisoylu and Alma, 2009
Dayisoylu, K.S.; Alma, M.H., Chemical analysis of essential oils from cone's rosin of Cilician fir (Abies cilicica subsp. cilicica), Afr. J. Biotechnol., 2009, 8, 15, 3502-3505. [all data]

Ho, Wang, et al., 2009
Ho, C.-L.; Wang, E.I.-C.; Su, Y.-C., Essential oil compositions and bioactivities of the various parts of Cinnamomum camphora Sieb. var. linallolifera Fujuta, Journal title only in Chinese, 2009, 31, 2, 77-96. [all data]

Karlsson, Birgersson, et al., 2009
Karlsson, M.F.; Birgersson, G.; Prado, A.M.C.; Bosa, F.; Bengtsson, M.; Witzgall, P., Plant Odor Analysis of Potato: Responce of Guatemalan Moth to Above- and Background Potato Volatiles, J. Agric. Food Chem., 2009, 57, 13, 5903-5909, https://doi.org/10.1021/jf803730h . [all data]

Lago, Favero, et al., 2009
Lago, J.H.G.; Favero, O.A.; Romoff, P., Chemical composition and seasonal variations of the volatile oils from leaves of Michelia champaca L., Magnoliaceae, Braz. J. Pharmacognosia, 2009, 19, 4, 880-882. [all data]

Marchesini, Prada, et al., 2009
Marchesini, A.M.; Prada, G.G.; Messiano, G.B.; Machado, M.B.; Lopes, L.M.X., Chemical constituents of Aristolochia giberti, J. Braz. Chem. Soc., 2009, 20, 9, 1598-1608, https://doi.org/10.1590/S0103-50532009000900006 . [all data]

Museli, Pau, et al., 2009
Museli, A.; Pau, M.; Desjobert, J.-M.; Foddai, M.; Usai, M.; Costa, J., Volatile constituents of Achllea ligustica All. by HS-SPME/GC/GC-MS. Comparison with essential oils obtained by hydrodistillation from Corsica and Sardinia, Chromatographia, 2009, 69, 5/6, 575-585, https://doi.org/10.1365/s10337-008-0939-1 . [all data]

Ottavioli, Bighelli, et al., 2009
Ottavioli, J.; Bighelli, A.; Casanova, J.; Bang, B.T.; Y., GC (retention indices), GC-MS, and 13C NMR of two citral-rich Cymbopogon leaf oils: C. Flexuosus and C. tortilis, Spectroscopy Lett., 2009, 42, 8, 506-512, https://doi.org/10.1080/00387010903022350 . [all data]

Retta, Gattuso, et al., 2009
Retta, D.; Gattuso, M.; Gattuso, S.; Lira, P. Di Leo; van Baren, C.; Ferraro, G.; Bandoni A., Essential oil composition of Achyrocline flaccida (Weinm.) DC. (Asteraceae) from different locations of Argentina, Biochem. Systematics Ecol., 2009, 36, 12, 877-881, https://doi.org/10.1016/j.bse.2008.11.001 . [all data]

Scrivanti, Anton, et al., 2009
Scrivanti, L.R.; Anton, A.M.; Zygadlo, J.A., Essential oil conposition of Bothriochloa Kuntze (Poaceae) from South America and their chemotaxonomy, Biochem. Systematics Ecol., 2009, 37, 3, 206-213, https://doi.org/10.1016/j.bse.2009.03.009 . [all data]

Zhao, Zeng, et al., 2009
Zhao, C.; Zeng, Y.; Wan, M.; Li, R.; Liang, Y.; Li, C.; Zeng, Z.; Chau, F.-T., Comparative analysis of essential oils from eight herbal medicines with pungent flavor and cool nature by GC-MS and chemometric resolution methods, J. Sep. Sci., 2009, 32, 4, 660-670, https://doi.org/10.1002/jssc.200800484 . [all data]

Baziou, Couladis, et al., 2008
Baziou, P.; Couladis, M.; Petrakis, P.V.; Verykokidou, E.; Harvala, C., Composition and antioxidant activity of the essential oil of Hypericum perfoliatum from Greece, 2008, retrieved from http://www.amapseec.org/cmapseec.1/Papers/papp065.htm. [all data]

Chieng, Assim, et al., 2008
Chieng, T.C.; Assim, Z.B.; Fasihuddin, B.A., Toxicity and antitermite activities of the essential oils from Piper sarmentosum, The Malaysian J. Anal. Sci., 2008, 12, 1, 234-239. [all data]

Forero, Quijano, et al., 2008
Forero, M.D.; Quijano, C.E.; Pino, J.A., Volatile compounds of Chile pepper (Capsicum annuum L. var. glabriusculum) at two ripening stages, Flavour Fragr. J., 2008, 24, 1, 25-30, https://doi.org/10.1002/ffj.1913 . [all data]

Khokra, Prakash, et al., 2008
Khokra, S.L.; Prakash, O.; Jain, S.; Aneja, K.R.; Dhingra, Y., Essential oil composition and antibacterial studies of Vitex negundo Linn. extracts, Indian J. Pharm. Sci., 2008, 70, 4, 522-526, https://doi.org/10.4103/0250-474X.44610 . [all data]

Lago, Romoff, et al., 2008
Lago, J.H.G.; Romoff, P.; Favero, O.A.; Souza, F.O.; Soares, M.G.; Baraldi, P.T.; Correa, A.G., Chemical composition of male and female Baccharis trimera (Less.) DC. (Asteraceae) essential oils, Biochem. Systematics Ecol., 2008, 36, 9, 737-740, https://doi.org/10.1016/j.bse.2008.05.009 . [all data]

Lo Presti, Sciarrone, et al., 2008
Lo Presti, M.; Sciarrone, D.; Crupi, M.C.; Costa, R.; Ragusa, S.; Dugo, G.; Mondello, L., Evaliation of the volatile and chiral composition in Pistacia lentiscus L. essential oil, Flavour Fragr. J., 2008, 23, 4, 249-257, https://doi.org/10.1002/ffj.1878 . [all data]

Noudogbessi, Yedomonhan, et al., 2008
Noudogbessi, J.-P.; Yedomonhan, P.; Sohounhloue, D.C.K.; Chalchat, J.-C.; Figueredo, G., Chemical composition of essential oil of syzygium guineense (Willd.) DC. var. guineense (Myrtaceae) from Benin, Rec. Nat. Prod., 2008, 33-38. [all data]

Paolini, Tomi, et al., 2008
Paolini, J.; Tomi, P.; Bernardini, A.-F.; Bradesi, P.; Casanova, J.; Kaloustian, J., Detailed analysis of the essential oil from Cistus albidus L. by combination of GC/RI, GC/MS and 13C-NMR spectroscopy, N.Z. J. Agric. Res., 2008, 22, 14, 1270-1278. [all data]

Raj, Baby, et al., 2008
Raj, G.; Baby, S.; Dan, M.; Thaha, A.R.M.; Sethuraman, M.G.; George, V., Volatile constituents from the rhisomes of Curcuma haritha Mangaly and Sabu from Sauthern India, Flavour Fragr. J., 2008, 23, 5, 348-352, https://doi.org/10.1002/ffj.1891 . [all data]

Sahraoui, Vian, et al., 2008
Sahraoui, N.; Vian, M.A.; Bornard, I.; Boutekedjiret, C.; Chemat, F., Improved microwave steam distillation apparatus for isolation of essential oils. Comparison with conventional steam distillation, J. Chromatogr. A., 2008, 1210, 2, 229-233, https://doi.org/10.1016/j.chroma.2008.09.078 . [all data]

Saidana, Mahjoub, et al., 2008
Saidana, D.; Mahjoub, M.A.; Boussaada, O.; Chriaa, J.; Cheraif, I.; Daami, M.; Mighri, Z.; Helal, A.N., Chemical composition and antimicrobial activity of volatile compounds of Tamarix boveana (Tamaricaceae), Microbiol. Res., 2008, 163, 4, 445-455, https://doi.org/10.1016/j.micres.2006.07.009 . [all data]

Sarikurkcu, Tepe, et al., 2008
Sarikurkcu, C.; Tepe, B.; Daferera, D.; Polissiou, M.; Harmandar, M., Studies on the anioxidant activity of the essential oil and methanol extract of Marrubium globosum subsp. globosum (lamiaceae) by three different chemical assays, Bioresource Technol., 2008, 99, 10, 4239-4246, https://doi.org/10.1016/j.biortech.2007.08.058 . [all data]

Verdian-rizi, 2008
Verdian-rizi, M., Phenological variations of Laurus nobilis L. essential oil from Iran, Electronic J. Environ. Agricultural Food Chem., 2008, 7, 11, 3321-3325. [all data]

Yassa and Akhani, 2008
Yassa, N.; Akhani, H., The essential oils composition in two species of the genus Eriocycla Lindl. (Apiaceae) from Iran, 2008, retrieved from http://biology.ut.ac.ir/members/akhani/PdfReprintNumber/27.pdf. [all data]

Argyropoulou, Daferera, et al., 2007
Argyropoulou, C.; Daferera, D.; Tarantilis, P.A.; Fasseas, C.; Polissiou, M., Chemical composition of the essential oil from leaves of Lippia citriodora H.B.K. (Verbenaceae) at two developmental stages, Biochem. Syst. Ecol., 2007, 35, 12, 831-837, https://doi.org/10.1016/j.bse.2007.07.001 . [all data]

Bos, Woerdenbag, et al., 2007
Bos, R.; Woerdenbag, H.J.; Kayser, O.; Quax, W.J.; Ruslan, K.; Elfami, Essential oil constituents of Piper cubeba L. fils. from Indonesia, J. Essent. Oil Res., 2007, 19, 1, 14-17, https://doi.org/10.1080/10412905.2007.9699217 . [all data]

Cheraif, Ben Jannet, et al., 2007
Cheraif, I.; Ben Jannet, H.; Hammami, M.; Khouja, M.L.; Mighri, Z., Chemical composition and antimicrobial activity of essential oils of Cupressus arizonica Greene, Biochem. Syst. Ecol., 2007, 35, 12, 813-820, https://doi.org/10.1016/j.bse.2007.05.009 . [all data]

Edris, Chizzola, et al., 2007
Edris, A.E.; Chizzola, R.; Franz, C., Isolation and characterization of the volatile aroma compounds from the concrete headspace and the absolute of Jasminum sambac (L.) Ait. (Oleaceae) flowers grown in Egypt, Eur. Food Res. Technol., 2007, https://doi.org/10.1007/s00217-007-0623-y . [all data]

Elfami, Bos, et al., 2007
Elfami; Bos, R.; Ruslan, K.; Woerdenbag, H.J.; Kayser, P.; Quax, W.J., Essential Oil Constituents of Piper cubeba from Indonesia, 2007, 53-60. [all data]

Ferhat, Meklati, et al., 2007
Ferhat, M.A.; Meklati, B.Y.; Chemat, F., Comparison of different isolation methods of essential oil from Citrus fruits: cold pressing, hydrodistillation and microwave dry distillation, Flavour Fragr. J., 2007, 22, 6, 494-504, https://doi.org/10.1002/ffj.1829 . [all data]

Ferhat, Tigrine-Kordjani, et al., 2007
Ferhat, M.A.; Tigrine-Kordjani, N.; Chemat, S.; Meklati, B.Y.; Chemat, F., Rapid Extraction of Volatile Compounds Using a New Simultaneous Microwave Distillation: Solvent Extraction Device, Chromatographia, 2007, 65, 3-4, 217-222, https://doi.org/10.1365/s10337-006-0130-5 . [all data]

Gudaityte and Venskutonis R.P., 2007
Gudaityte, O.; Venskutonis R.P., Chemotypes of Achillea millefolium transferred from 14 different locations in Lithuania to the controlled environment, Biochem. Syst. Ecol., 2007, 35, 9, 582-592, https://doi.org/10.1016/j.bse.2007.03.016 . [all data]

Hachicha, Skanji, et al., 2007
Hachicha, S.F.; Skanji, T.; Barrek, S.; Ghrabi, Z.G.; Zarrouk, H., Composition of the essential oil of Teucrium ramosissimum Desf. (Lamiaceae) from Tunisia, Flavour Fragr. J., 2007, 22, 2, 101-104, https://doi.org/10.1002/ffj.1764 . [all data]

Limberger, Scopel, et al., 2007
Limberger, R.P.; Scopel, M.; Sobral, M.; Henriques, A.T., Comparative analysis of volatiles from Drimys brasiliensis Miers and D. angustifolia Miers (Winteraceae) from Southern Brazil, Biochem. Syst. Ecol., 2007, 35, 3, 130-137, https://doi.org/10.1016/j.bse.2006.09.007 . [all data]

Mohottalage, Tabacchi, et al., 2007
Mohottalage, S.; Tabacchi, R.; Guerin, P.M., Components from Sri Lankan Piper betle L. leaf oil and their analogues showing toxicity against the housefly, Musca domestica, Flavour Fragr. J., 2007, 22, 2, 130-138, https://doi.org/10.1002/ffj.1770 . [all data]

Moreno, Lima, et al., 2007
Moreno, P.R.H.; Lima, M.E.L.; Sobral, M.; Young, M.C.M.; Cordeiro, I.; Apel, M.A.A.; Limberger, R.P.; Henriques, A.T., Essential oil composition of fruit colour varieties of Eugenia brasiliensis Lam., Sci. Agr.; (Piracicaba Praz.), 2007, 64, 4, 428-432. [all data]

Morteza-Semnani, Saeedi, et al., 2007
Morteza-Semnani, K.; Saeedi, M.; Akbarzadeh, M., Essential oil composition of Teucrium scordium L., Acta Pharm., 2007, 57, 4, 499-504, https://doi.org/10.2478/v10007-007-0040-6 . [all data]

Oliveira, Leitão, et al., 2007
Oliveira, D.R.; Leitão, G.G.; Bizzo, H.R.; Lopes, D.; Alviano, D.S.; Alviano, C.S.; Leitão, S.G., Chemical and antimicrobial analyses of essential oil of Lippia origanoides H.B.K, Food Chem., 2007, 101, 1, 236-240, https://doi.org/10.1016/j.foodchem.2006.01.022 . [all data]

Ozcan and Chalchat, 2007
Ozcan, M.M.; Chalchat, J.C., Chemical Composition od Carrot Seeds (Daucus carota L.) Cultivated in Turkey: Characterization of the Seed Oil and Essential Oil, Grasas y Aceites, 2007, 58, 4, 359-365. [all data]

Phutdhawong, Kawaree, et al., 2007
Phutdhawong, W.; Kawaree, R.; Sanjaia, S.; Sengpracha, W.; Buddhasukh, D., Microwave-Assisted Isolation of Essential Oil of Cinnamomum iners Reinw. es Bl.: Comparison with Conventional Hydrodistillation, Molecules, 2007, 12, 4, 868-877, https://doi.org/10.3390/12040868 . [all data]

Pinto, Salgueiro, et al., 2007
Pinto, E.; Salgueiro, L.R.; Cavaleiro, C.; Palmeira, A.; Goncalves, M.J., In vitro susceptibility of some species of yeasts and filamentous fungi to essential oils of Salvia of?cinalis, Ind. Crops Prod., 2007, 26, 2, 135-141, https://doi.org/10.1016/j.indcrop.2007.02.004 . [all data]

Ristic, Krivokuca-Dokic, et al., 2007
Ristic, M.; Krivokuca-Dokic, D.; Radanovic, D.; Nastovski, T., Etarsko ulje Arnica montata i Arnica chamissonis, Hem. Ind., 2007, 61, 5, 272-277, https://doi.org/10.2298/HEMIND0704272R . [all data]

Sylvestre, Longtin, et al., 2007
Sylvestre, M.; Longtin, A.P.A.; Legault, J., Volatile leaf condtituents and anticancer activity of Bursera simaruba (L.) Sarg. essential oil, Natural Product Communications, 2007, 2, 12, 1273-1276. [all data]

Tava, Pecetti, et al., 2007
Tava, A.; Pecetti, L.; Ricci, M.; Pagnotta, M.A.; Russi, L., Volatile compounds from leaves and flowers of Bituminaria bituminosa (L.) Stirt. (Fabaceae) from Italy, Flavour Fragr. J., 2007, 22, 5, 363-370, https://doi.org/10.1002/ffj.1806 . [all data]

Tzakou, Bazos, et al., 2007
Tzakou, O.; Bazos, I.; Yannitsaros, A., Volatile metabolites of Pistacia atlantica Desf. from Greece, Flavour Fragr. J., 2007, 22, 5, 358-362, https://doi.org/10.1002/ffj.1805 . [all data]

Vagionas, Graikou, et al., 2007
Vagionas, K.; Graikou, K.; Ngassapa, O.; Runyoro, D.; Chinou, I., Composition and antimicrobial activity of the essential oils of three Satureja species growing in Tansania, Food Chem., 2007, 103, 2, 319-324, https://doi.org/10.1016/j.foodchem.2006.07.051 . [all data]

Vichi, Riu-Aumatell, et al., 2007
Vichi, S.; Riu-Aumatell, M.; Mora-Pons, M.; Guadayol, J.M.; Buxaderas, S.; López-Tamames, E., Analytical, Nutritional and Clinical Methods. HS-SPME coupled to GC/MS for quality control of Juniperus communis L. berries used for gin aromatization, Food Chem., 2007, 105, 4, 1748-1754, https://doi.org/10.1016/j.foodchem.2007.03.026 . [all data]

Yassa and Akhani, 2007
Yassa, N.; Akhani, H., The essential oils composition in two species of the genus Eriocycla Lindl. (Apiaceae) from Iran, 2007, retrieved from http://biology.ut.ac.ir/members/akhani/PdfReprintNumber/27.pdf. [all data]

Zizovic, Stamenic, et al., 2007
Zizovic, I.; Stamenic, M.; Ivanovic, J.; Orlovic, A.; Ristic, M.; Djordjevic, S.; Petrovic, S.D.; Skala, D., Supercritical carbon dioxide extraction of sesquiterpenes from valerian root, J. Supercrit. Fluids, 2007, 43, 2, 249-258, https://doi.org/10.1016/j.supflu.2007.05.007 . [all data]

Apel, Sobral, et al., 2006
Apel, M.A.; Sobral, M.; Zuanazzi, J.A.S.; Henriques, A.T., Essential oil composition of four Plinia species (Myrtaceae), Flavour Fragr. J., 2006, 21, 3, 565-567, https://doi.org/10.1002/ffj.1638 . [all data]

Apel, Sobral, et al., 2006, 2
Apel, M.A.; Sobral, M.; Zuanazzi, J.A.S.; Henriques, A.T., Essential oil composition of Calycorectes australis and Calycorectes psidiiflorus (Myrtaceae), Flavour Fragr. J., 2006, 21, 4, 656-658, https://doi.org/10.1002/ffj.1640 . [all data]

Ayoub, Al-Azizi, et al., 2006
Ayoub, N.; Al-Azizi, M.; König, W.; Kubeczka, K.-H., Essential oils and a novel polyacetylene from Eryngium yuccifolium Michaux. (Apiaceae), Flavour Fragr. J., 2006, 21, 6, 864-868, https://doi.org/10.1002/ffj.1631 . [all data]

Boti, Yao, et al., 2006
Boti, J.B.; Yao, P.A.; Koukoua, G.; N'Guessan, T.Y.; Casanova, J., Components and chemical variability of Isolona campanulata Engler Diels leaf oil, Flavour Fragr. J., 2006, 21, 1, 166-170, https://doi.org/10.1002/ffj.1555 . [all data]

Cavaleiro, Pinto, et al., 2006
Cavaleiro, C.; Pinto, E.; Gonsales, M.J.; Salguero, L., Antifungal activity of Juniperus essential oils agains dermatophyte, Asrgillus and Candida strains, J. Appl. Microbiol., 2006, 100, 6, 1333-1338, https://doi.org/10.1111/j.1365-2672.2006.02862.x . [all data]

Chen, Sheu, et al., 2006
Chen, H.-C.; Sheu, M.-J.; Wu, C.-M., Characterization of Volatiles in Guava (Psidium guajava L. cv. Chung-Shan-Yueh-Pa) Fruit from Taiwan, J. Food Drug. Anal., 2006, 14, 4, 398-402. [all data]

Damjanovic, Skala, et al., 2006
Damjanovic, B.; Skala, D.; Baras, J.; Petrovic-Djakov, D., Isolation of essential oil and supercritical carbon dioxide extract of Juniperus communis L. fruits from Montenegro, Flavour Fragr. J., 2006, 21, 6, 875-880, https://doi.org/10.1002/ffj.1711 . [all data]

Ebrahim Sajjadi and Mehregan, 2006
Ebrahim Sajjadi, S.; Mehregan, I., Volatile constituents of flowers and leaves of Anthemis hyalina, Chem. Nat. Compd. (Engl. Transl.), 2006, 42, 5, 531-533, https://doi.org/10.1007/s10600-006-0207-2 . [all data]

Elfami, Komar, et al., 2006
Elfami, R.B.; Komar, R.; Woerdenbag, H.J.; Kayser, P.; Quax, W.J., Essential oil constituents of Piper cubeba from Indonesia, 2006, retrieved from http://dissertations.ub.rug.nl/FILES/facultiew/science/2006/elfahmi/05c5.pdf. [all data]

Fernandez, Pintaric, et al., 2006
Fernandez, X.; Pintaric, C.; Lizzani-Cuvelier, L.; Loiseau, A.-M.; Morello, A.; Pellerin, P., Chemical composition of absolute and supercritical carbon dioxide extract of Aframomum melegueta, Flavour Fragr. J., 2006, 21, 1, 162-165, https://doi.org/10.1002/ffj.1554 . [all data]

Figuérédo, Cabassu, et al., 2006
Figuérédo, G.; Cabassu, P.; Chalchat, J.-C.; Pasquier, B., Studies of Mediterranean oregano populations. VIII. Chemical composition of essential oils of oreganos of various origins, Flavour Fragr. J., 2006, 21, 1, 134-139, https://doi.org/10.1002/ffj.1543 . [all data]

Garneau F.X., Collin G., et al., 2006
Garneau F.X.; Collin G.; Gagnon H.; Jean F.I.; Strobl H.; Pichette A., The essential oil composition of Devil's Club, Oplopanax horridus J. E. Smith Miq., Flavour Fragr. J., 2006, 21, 5, 792-794, https://doi.org/10.1002/ffj.1716 . [all data]

Javidnia, Miri, et al., 2006
Javidnia, K.; Miri, R.; Kamalinejad, M.; Mehdipour, A.R., Composition of the essential oil of Diplotaenia cachrydifolia Boiss. from Iran, J. Ess. Oil Res., 2006, 18, 1, 86-87, https://doi.org/10.1080/10412905.2006.9699393 . [all data]

Kucuk, Gulec, et al., 2006
Kucuk, M.; Gulec, C.; Yasar, A.; Ucuncu, O.; Yayh, N.; Coskuncelebi, K.; Terzioglu, S.; Yayh, N., Chemical composition and antimicrobial activities of the essential oils of Teucrium chamaedrys subsp. chamaedrys, T. orientale var. puberulens, and T. chamaedrys subsp. lydium, Pharm. Biol., 2006, 44, 8, 592-599, https://doi.org/10.1080/13880200600896868 . [all data]

Kula, Izydorczyk, et al., 2006
Kula, J.; Izydorczyk, K.; Czajkowska, A.; Bonikowski, R., Chemical composition of carrot umbel oils from Daucus carota L. ssp. sativus cultivated in Poland, Flavour Fragr. J., 2006, 21, 4, 667-669, https://doi.org/10.1002/ffj.1646 . [all data]

Lesueur, Ban, et al., 2006
Lesueur, D.; Ban, N.K.; Bighelli, A.; Muselli, A.; Casanova, J., Analysis of the root oil of Fokienia hodginsii (Dunn) Henry et Thomas (Cupressaceae) by GC, GC-MS and 13C-NMR, Flavour Fragr. J., 2006, 21, 1, 171-174, https://doi.org/10.1002/ffj.1557 . [all data]

Lis and Milczarek, 2006
Lis, A.; Milczarek, J., Chemical composition of the essential oils from fruits, leaves and flowers of Phellodendron sachalinense (Fr. Schmidt) Sarg., Flavour Fragr. J., 2006, 21, 4, 683-686, https://doi.org/10.1002/ffj.1662 . [all data]

Morteza-Semnani, Akbarzadeh, et al., 2006
Morteza-Semnani, K.; Akbarzadeh, M.; Changizi, S., Essential oils composition of Stachys byzantina, S. inflata, S. lavandulifolia and S. laxa from Iran, Flavour Fragr. J., 2006, 21, 2, 300-303, https://doi.org/10.1002/ffj.1594 . [all data]

Morteza-Semnani K., Saeedi M., et al., 2006
Morteza-Semnani K.; Saeedi M.; Changizi S., The essential oil composition of Hypericum scabrum L. from Iran, Flavour Fragr. J., 2006, 21, 3, 513-515, https://doi.org/10.1002/ffj.1614 . [all data]

Olawore, Usman, et al., 2006
Olawore, N.O.; Usman, L.A.; Ogunwande, I.A.; Adeleke, K.A., Constituents of rhizome essential oils of two types of Cyperus articulatus L. grown in Nigeria, J. Essent Oil Res., 2006, 18, 6, 604-606, https://doi.org/10.1080/10412905.2006.9699179 . [all data]

Orav, Raal, et al., 2006
Orav, A.; Raal, A.; Arak, E.; Müürisepp, M.; Kailas, T., Composition of the essential oil of Artemisia absinthium L. of different geographical origin, Proc. Est. Acad. Sci. Chem., 2006, 55, 3, 155-165. [all data]

Ouamba, Ouabonzi, et al., 2006
Ouamba, J.-M.; Ouabonzi, A.; Ekouya, A.; Bessière, J.-M.; Menut, C.; Abena, A.A.; Banzouzi, J.-T., Volatile constituents of the essential oil leaf of Lantana salvifolia Jacq. (Verbenaceae), Flavour Fragr. J., 2006, 21, 1, 158-161, https://doi.org/10.1002/ffj.1553 . [all data]

Pino, Marbot, et al., 2006
Pino, J.A.; Marbot, R.; Payo, A.; Chao, D.; Herrera, P., Aromatic Plants from Western Cuba VII. Composition of the Leaf Oil of Psidium wrightii KRug et Urb., Lantana involucrata L., Cinnamonum montanum (Sw.) Berchtold et J. Persl. and Caesalpinia violacea (Mill.) Standley, J. Essent. Oil. Res., 2006, 18, 2, 170-174, https://doi.org/10.1080/10412905.2006.9699058 . [all data]

Pino, Sauri-Duch, et al., 2006
Pino, J.; Sauri-Duch, E.; Marbot, R., Changes in volatile compounds of Habanero chile pepper (Capsicum chinense Jack. cv. Habanero) at two ripening stages, Food Chem., 2006, 94, 3, 394-398, https://doi.org/10.1016/j.foodchem.2004.11.040 . [all data]

Potzernheim, Bizzo, et al., 2006
Potzernheim, M.C.L.; Bizzo, H.R.; Vieira, R.F., Analysis of the essential oil of three species of Piper collected in the region of the Distrito Federal (Cerrado - Brazilian Savannah) and comparison with oils of plants from region of Paraty, State of Rio de Janeiro (Atlantic Rain Forest), Brazilian Journal of Pharmacognosy, 2006, 16, 2, 246-251. [all data]

Rout, Naik, et al., 2006
Rout, P.K.; Naik, S.N.; Rao, Y.R., Composition of the concrete, absolute, headspace and essential oil of the flowers of Michelia champaca Linn., Flavour Fragr. J., 2006, 21, 6, 906-911, https://doi.org/10.1002/ffj.1742 . [all data]

Sabulal, Dan, et al., 2006
Sabulal, B.; Dan, M.; Anil, J.J.; Kurup, R.; Pradeep, N.S.; Valsamma, R.K.; George, V., Caryophyllene-rich rhizome oil of Zingiber nimmonii from South India: Chemical characterization and antimicrobial activity, Phytochemistry, 2006, 67, 22, 2469-2473, https://doi.org/10.1016/j.phytochem.2006.08.003 . [all data]

Sabulal, Dan, et al., 2006, 2
Sabulal, B.; Dan, M.; Pradeep, N.S.; Valsamma, R.K.; George, V., Composition and antimicrobial activity of essential oil from the fruits of Amomum cannicarpum, Acta Pharm. Sin., 2006, 56, 473-480. [all data]

Sonboli, Mirjalili, et al., 2006
Sonboli, A.; Mirjalili, M.H.; Yousefzadi, M., Antimicrobial activity and composition of the essential oil of Cymbopogon Olivieri (Boiss.) Bor from Iran, Iranian J. Pharm. Res., 2006, 1, 65-68. [all data]

Tesso, Kubeczka, et al., 2006
Tesso, H.; Kubeczka, K.-H.; König, W.A., A new phthalide from the essential oil of Meum athamanticum, Flavour Fragr. J., 2006, 21, 4, 622-625, https://doi.org/10.1002/ffj.1629 . [all data]

Tonzibo, Coffy, et al., 2006
Tonzibo, Z.F.; Coffy, A.A.; Chalachat, J.C.; N'guessan, Y.T., Chemical composition of essential oils of Hoslundia opposita Vahl. from Ivory Coast., Flavour Fragr. J., 2006, 21, 5, 789-791, https://doi.org/10.1002/ffj.1715 . [all data]

Velasco-Negueruela, Pérez-Alonso, et al., 2006
Velasco-Negueruela, A.; Pérez-Alonso, M.J.; Pérez de Paz, P.L.; Palá-Paúl, J.; Sanz, J., Analysis by gas chromatography?mass spectrometry of the volatiles from the fruits of Ammodaucus leucotrichus subsp. leucotrichus and subsp. nanocarpus grown in North Africa and the Canary Islands, respectively, J. Chromatogr. A, 2006, 1108, 2, 273-275, https://doi.org/10.1016/j.chroma.2006.01.031 . [all data]

Wong, Lim, et al., 2006
Wong, K.C.; Lim, T.B.; Ali, D.M.H., Essential oil of Homalomena sagittifolia Jungh., Flavour Fragr. J., 2006, 21, 5, 786-788, https://doi.org/10.1002/ffj.1714 . [all data]

Wong, Sivasothy, et al., 2006
Wong, K.C.; Sivasothy, Y.; Boey, P.L., Essential oil of Elettariopsis elan C.K. Lim, Flavour Fragr. J., 2006, 21, 3, 562-564, https://doi.org/10.1002/ffj.1654 . [all data]

Busman, Zoghbi, et al., 2005
Busman, D.V.; Zoghbi, M.G.B.; Potiguara, R.C.V.; Andrade, E.H.A., Volatiles from different organs of Unxia camphorata L. f. growing wild in the Amazon, Biochem. Syst. Ecol., 2005, 33, 12, 1269-1273, https://doi.org/10.1016/j.bse.2005.07.001 . [all data]

Chagonda and Chalchat, 2005
Chagonda, L.S.; Chalchat, J.-C., The essential oil of the fruit of Garcinia huillensis Welw. ex. Oliv. from Zimbabwe, Flavour Fragr. J., 2005, 20, 3, 313-315, https://doi.org/10.1002/ffj.1420 . [all data]

Chaverri and Cicció, 2005
Chaverri, C.; Cicció, J.F., Essential oil of trees of the genus Ocotea (Lauraceae) in Costa Rica. I. Ocotea brenesii, Rev. Biol. Trop., 2005, 53, 3-4, 431-436, https://doi.org/10.15517/rbt.v53i3-4.14611 . [all data]

Duarte, Figueira, et al., 2005
Duarte, M.C.T.; Figueira, G.M.; Sartoratto, A.; Rehder, V.L.G.; Delarmelina, C., Anti-Candida activity of Brazilian medicinal plants, J. Ethnopharmacol., 2005, 97, 2, 305-311, https://doi.org/10.1016/j.jep.2004.11.016 . [all data]

Facey, Porter, et al., 2005
Facey, P.C.; Porter, R.B.R.; Reese, P.B.; Williams, L.A.D., Biological activity and chemical composition of the essential oil from Jamaican Hyptis verticillata Jacq., J. Agric. Food Chem., 2005, 53, 12, 4774-4777, https://doi.org/10.1021/jf050008y . [all data]

Fakhari A.R., Sonboli A., et al., 2005
Fakhari A.R.; Sonboli A.; Heydari R., Composition of the essential oil of Rhabdosciadium strausii from Iran, Chem. Nat. Compd. (Engl. Transl.), 2005, 41, 4, 413-414, https://doi.org/10.1007/s10600-005-0164-1 . [all data]

Ferraz, Limberger, et al., 2005
Ferraz, A.B.F.; Limberger, R.P.; Bordignon, S.A.L.; von Poser, G.L.; Henriques, A.T., Essential oil composition of six Hypericum species from southern Brazil, Flavour Fragr. J., 2005, 20, 3, 335-339, https://doi.org/10.1002/ffj.1435 . [all data]

Ferretti, Maggi, et al., 2005
Ferretti, G.; Maggi, F.; Tirillini, B., Essential oil composition of Hypericum richeri Vill. from Italy, Flavour Fragr. J., 2005, 20, 3, 295-298, https://doi.org/10.1002/ffj.1412 . [all data]

Figuérédo, Cabassu, et al., 2005
Figuérédo, G.; Cabassu, P.; Chalchat, J.-C.; Pasquier, B., Studies of Mediterranean oregano populations- V. Chemical composition of essential oils of oregano: Origanum syriacum L. var. bevanii (Holmes) Ietswaart, O. syriacum L. var. sinaicum (Boiss.) Ietswaart, and O. syriacum L. var. syriacum from Lebanon and Israel, Flavour Fragr. J., 2005, 20, 164-168. [all data]

Gauvin and Smadja, 2005
Gauvin, A.; Smadja, J., Essential oil composition of four Psiadia species from Reunion Island: A chemotaxonomic study, Biochem. Syst. Ecol., 2005, 33, 7, 705-714, https://doi.org/10.1016/j.bse.2004.12.013 . [all data]

Kowalski and Wolski, 2005
Kowalski, R.; Wolski, T., The chemical composition of essential oils of Silphium perfoliatum L., Flavour Fragr. J., 2005, 20, 3, 306-310, https://doi.org/10.1002/ffj.1418 . [all data]

Limberger, Sobral, et al., 2005
Limberger, R.P.; Sobral, M.; Henriques, A.T., Intraspecific volatile oil variation in Myrceugenia cucullata (Myrtaceae), Biochem. Syst. Ecol., 2005, 33, 3, 287-293, https://doi.org/10.1016/j.bse.2004.10.002 . [all data]

Morteza-Semnani, Akbarzadeh, et al., 2005
Morteza-Semnani, K.; Akbarzadeh, M.; Rostami, B., The essential oil composition of Teucrium chamaedrys L. from Iran, Flavour Fragr. J., 2005, 20, 5, 544-546, https://doi.org/10.1002/ffj.1479 . [all data]

Morteza-Semnani and Saeedi, 2005
Morteza-Semnani, K.; Saeedi, M., The essential oil composition of Phlomis bruguieri Desf. from Iran, Flavour Fragr. J., 2005, 20, 3, 344-346, https://doi.org/10.1002/ffj.1459 . [all data]

Olawore, Ogunwande, et al., 2005
Olawore, N.O.; Ogunwande, I.A.; Ekundayo, O.; Adeleke, K.A., Chemical composition of the leaf and fruit essential oils of Murraya paniculata (L.) Jack. (Syn. Murraya exotica Linn.), Flavour Fragr. J., 2005, 20, 1, 54-56, https://doi.org/10.1002/ffj.1365 . [all data]

Oyedeji, Yani, et al., 2005
Oyedeji, O.A.; Yani, V.V.; Afolayan, A.J., Chemical composition of the essential oil from Arctotis arctotoides (L.F.) O. Hoffm. (syn. Vendium arctotoides Less.), Flavour Fragr. J., 2005, 20, 2, 232-234, https://doi.org/10.1002/ffj.1437 . [all data]

Pala-Paul, Perez-Alonso, et al., 2005
Pala-Paul, J.; Perez-Alonso, M.J.; Velasco-Negueruela, A.; Vadare, J.; Villa, A.M.; Sanz, J.; Brophy, J.J., Essential oil composition of the different parts of Eryngium bourgatii Gouan from Spain, J. Chromatogr. A, 2005, 1074, 1-2, 235-239, https://doi.org/10.1016/j.chroma.2005.03.036 . [all data]

Petrakis, Roussis, et al., 2005
Petrakis, P.V.; Roussis, V.; Papadimitriou, D.; Vagias, C.; Tsitsimpikou, C., The effect of terpenoid extracts from 15 pine species on the feeding behavioural sequence of the late instars of the pine processionary caterpillar Thaumetopoea pityocampa, Behav. Processes, 2005, 69, 3, 303-322, https://doi.org/10.1016/j.beproc.2004.12.008 . [all data]

Sajjadi S.E. and Eskandari B., 2005
Sajjadi S.E.; Eskandari B., Chemical constituents of the essential oil of Nepeta oxyodonta, Chem. Nat. Compd. (Engl. Transl.), 2005, 41, 2, 175-177, https://doi.org/10.1007/s10600-005-0106-y . [all data]

Sarkhail, Amin, et al., 2005
Sarkhail, P.; Amin, G.; Surmaghi, M.H.S.; Shafiee, A., Composition of the volatile oils of Phlomis lanceolata Boiss. Hohen., Phlomis anisodonta Boiss. and Phlomis bruguieri Desf. from Iran, Flavour Fragr. J., 2005, 20, 3, 327-329, https://doi.org/10.1002/ffj.1427 . [all data]

Sefidkon and Jamzad, 2005
Sefidkon, F.; Jamzad, Z., Chemical composition of the essential oil of three Iranian Satureja species (S. mutica, S. macrantha and S. intermedia), Food Chem., 2005, 91, 1, 1-4, https://doi.org/10.1016/j.foodchem.2004.01.027 . [all data]

Senatore, Apostolides Arnold, et al., 2005
Senatore, F.; Apostolides Arnold, N.; Bruno, M., Volatile components of Centaurea eryngioides Lam. and Centaurea liberica Trev. var. hermonis Boiss. Lam., two Asteraceae growing wild in Lebanon, Nat. Prod. Res., 2005, 19, 8, 749-754, https://doi.org/10.1080/14786410412331302136 . [all data]

Setzer, Noletto, et al., 2005
Setzer, W.N.; Noletto, J.A.; Lawton, R.O.; Haber, W.A., Leaf essential oil composition of five Zanthoxylum species from Monteverde, Costa Rica, Molecular Diversity, 2005, 9, 1-3, 3-13, https://doi.org/10.1007/s11030-005-1298-6 . [all data]

Simoes-Pires C.A., Debenedetti S., et al., 2005
Simoes-Pires C.A.; Debenedetti S.; Spegazzini E.; Mentz L.A.; Matzenbacher N.I.; Limberger R.P.; Henriques A.T., Investigation of the essential oil from eight species of Baccharis belonging to sect. Caulopterae (Asteraceae, Astereae): a taxonomic approach, Plant Systematics and Evolution, 2005, 253, 1-4, 23-32, https://doi.org/10.1007/s00606-005-0296-6 . [all data]

Singh, Raina, et al., 2005
Singh, A.K.; Raina, V.K.; Naqvi, A.A.; Patra, N.K.; Kumar, B.; Ram, P.; Khanuja, S.P.S., Essential oil composition and chemoarrays of menthol mint (Mentha arvensis L. f. piperascens Malinvaud ex. Holmes) cultivars, Flavour Fragr. J., 2005, 20, 3, 302-305, https://doi.org/10.1002/ffj.1417 . [all data]

Slavkovska, Couladis, et al., 2005
Slavkovska, V.; Couladis, M.; Bojovic, S.; Tzakou, O.; Pavlovic, M.; Lakusic, B.; Jancic, R., Essential oil and its systematic significance in species of Micromeria Bentham from Serbia Montenegro, Plant Systematics and Evolution, 2005, 255, 1-2, 1-15, https://doi.org/10.1007/s00606-005-0303-y . [all data]

Sonboli, Salehi, et al., 2005
Sonboli, A.; Salehi, P.; Ebrahimi, S.N., Essential oil composition and antibacterial activity of the leaves of Stachys schtschegleevii from Iran, Chem. Nat. Compd. (Engl. Transl.), 2005, 41, 2, 171-175, https://doi.org/10.1007/s10600-005-0105-z . [all data]

Sonboli, Salehi, et al., 2005, 2
Sonboli, A.; Salehi, P.; Allahyari, L., Essential oil composition of Nepeta involucrata from Iran, Chem. Nat. Compd. (Engl. Transl.), 2005, 41, 6, 683-685, https://doi.org/10.1007/s10600-006-0011-z . [all data]

Srivastava, Srivastava, et al., 2005
Srivastava, A.K.; Srivastava, S.K.; Syamsundar, K.V., Bud and leaf essential oil composition of Syzygium aromaticum from India and Madagascar, Flavour Fragr. J., 2005, 20, 1, 51-53, https://doi.org/10.1002/ffj.1364 . [all data]

Stevanovic, Garneau, et al., 2005
Stevanovic, T.; Garneau, F.-X.; Jean, F.-I.; Gagnon, H.; Vilotic, D.; Petrovic, S.; Ruzic, N.; Pichette, A., The essential oil composition of Pinus mugo Turra from Serbia, Flavour Fragr. J., 2005, 20, 1, 96-97, https://doi.org/10.1002/ffj.1390 . [all data]

Suárez, Vásquez, et al., 2005
Suárez, A.I.; Vásquez, L.J.; Manzano, M.A.; Compagnone, R.S., Essential oil composition of Croton cuneatus and Croton malambo growing in Venezuela, Flavour Fragr. J., 2005, 20, 6, 611-614, https://doi.org/10.1002/ffj.1498 . [all data]

Szafranek, Chrapkowska, et al., 2005
Szafranek, B.; Chrapkowska, K.; Pawinska, M.; Szafranek, J., Analysis of leaf surface sesquiterpenes in potato varieties, J. Agric. Food Chem., 2005, 53, 8, 2817-2822, https://doi.org/10.1021/jf040437g . [all data]

Tzakou, Bazos, et al., 2005
Tzakou, O.; Bazos, I.; Yannitsaros, A., Essential oils of leaves, inflorescences and infructescences of spontaneous Cotinus coggygria Scop. from Greece, Flavour Fragr. J., 2005, 20, 5, 531-533, https://doi.org/10.1002/ffj.1456 . [all data]

Tzakou and Constantinidis, 2005
Tzakou, O.; Constantinidis, T., Chemotaxonomic significance of volatile compounds in Thymus samius and its related species Thymus atticus and Thymus parnassicus, Biochem. Syst. Ecol., 2005, 33, 11, 1131-1140, https://doi.org/10.1016/j.bse.2005.03.008 . [all data]

Urdampilleta, Amat, et al., 2005
Urdampilleta, J.D.; Amat, A.G.; Bidau, C.J.; Koslobsky, N.K., Biosystematic and chemosystematic studies in five South Americal species of Conyza (Asteraceae), Bol. Soc. Argent. Bot., 2005, 40, 1-2, 101-107. [all data]

Velasco-Negueruela, Pérez-Alonso, et al., 2005
Velasco-Negueruela, A.; Pérez-Alonso, M.J.; Pérez de Paz, P.L.; Palá-Paúl, J.; Sanz, J., Analysis by gas chromatography-mass spectrometry of the essential oils from the aerial parts of Pimpinella anagodendron Bolle and Pimpinella rupicola Svent., two endemic species to the Canary Islands, Spain, J. Chromatogr. A, 2005, 1095, 1-2, 180-184, https://doi.org/10.1016/j.chroma.2005.09.074 . [all data]

Velasco-Negueruela, Pérez-Alonso, et al., 2005, 2
Velasco-Negueruela, A.; Pérez-Alonso, M.J.; Palá-Paúl, J.; Iñigo, A.; López, G., The volatile oil composition of the berries of Juniperus macrocarpa Sibth. and Sm., gathered in Spain, J. Essent. Oil Res., 2005, 17, 1, 61-63, https://doi.org/10.1080/10412905.2005.9698831 . [all data]

Vichi, Riu-Aumatell, et al., 2005
Vichi, S.; Riu-Aumatell, M.; Mora-Pons, M.; Buxaderas, S.; Lopez-Tamames, E., Characterization of Volatiles in Different Dry Gins, J. Agric. Food Chem., 2005, 53, 26, 10154-10160, https://doi.org/10.1021/jf058121b . [all data]

Agnaniet, Menut, et al., 2004
Agnaniet, H.; Menut, C.; Bessière, J.-M., Aromatic plants of tropical central Africa. Part XLIX: chemical composition of essential oils of the leaf and rhizome of Aframomum giganteum K. Schum from Gabon, Flavour Fragr. J., 2004, 19, 3, 205-209, https://doi.org/10.1002/ffj.1403 . [all data]

Blanc, Muselli, et al., 2004
Blanc, M.-C.; Muselli, A.; Bradesi, P.; Casanova, J., Chemical composition and variability of the essential oil of Inula graveolens from Corsica, Flavour Fragr. J., 2004, 19, 4, 314-319, https://doi.org/10.1002/ffj.1304 . [all data]

Fekam Boyom, Fotio, et al., 2004
Fekam Boyom, F.; Fotio, D.; Amvam Zollo, P.H.; Agnaniet, H.; Menut, C.; Bessière, J.M., Aromatic plants of tropical Central Africa. Part XLIV. Volatile components from Pseudocedrela kotschyi (Schweinf.) harms growing in Cameroon, Flavour Fragr. J., 2004, 19, 1, 9-11, https://doi.org/10.1002/ffj.1254 . [all data]

González, Guerra, et al., 2004
González, S.; Guerra, P.E.; Bottaro, H.; Molares, S.; Demo, M.S.; Oliva, M.M.; Zunino, M.P.; Zygadlo, J.A., Aromatic plants from Patagonia. Part I. Antimicrobial activity and chemical composition of Schinus polygamus (Cav.) Cabrera essential oil, Flavour Fragr. J., 2004, 19, 1, 36-39, https://doi.org/10.1002/ffj.1270 . [all data]

Kalvandi, Sefidkon, et al., 2004
Kalvandi, R.; Sefidkon, F.; Atri, M.; Mirza, M., Analysis of the essential oil of Thymus eriocalyx from Iran, Flavour Fragr. J., 2004, 19, 4, 341-343, https://doi.org/10.1002/ffj.1312 . [all data]

Kalemba and Thiem, 2004
Kalemba, D.; Thiem, B., Constituents of the essential oils of four micropropagated Solidago species, Flavour Fragr. J., 2004, 19, 1, 40-43, https://doi.org/10.1002/ffj.1271 . [all data]

Lago, de Ávila, et al., 2004
Lago, J.H.G.; de Ávila, P., Jr.; de Aquino, E.M.; Moreno, P.R.H.; Ohara, M.T.; Limberger, R.P.; Apel, M.A.; Henriques, A.T., Volatile oils from leaves and stem barks of Cedrela fissilis (Meliaceae): chemical composition and antibacterial activities, Flavour Fragr. J., 2004, 19, 5, 448-451, https://doi.org/10.1002/ffj.1347 . [all data]

Limberger, Sobral, et al., 2004
Limberger, R.P.; Sobral, M.; Henriques, A.T.; Menut, C.; Bessière, J.-M., Óleos voláteis de espécies de Myrcia nativas do rio grande do sul, Quim. Nova, 2004, 27, 6, 916-919, https://doi.org/10.1590/S0100-40422004000600015 . [all data]

Lopez Arze, Collin, et al., 2004
Lopez Arze, J.B.; Collin, G.; Garneau, F.-X.; Jean, F.-I.; Gagnon, H., Essential oils from Bolivia. II. Asteraceae: Ophryosporus heptanthus (Wedd.) H. Rob. et King, J. Essent. Oil Res., 2004, 16, 4, 374-376, https://doi.org/10.1080/10412905.2004.9698747 . [all data]

Malencic, Couladis, et al., 2004
Malencic, Dj.; Couladis, M.; Mimica-Dukic, N.; Popovic, M.; Boza, P., Essential oils of three Salvia species from the Pannonian part of Serbia, Flavour Fragr. J., 2004, 19, 3, 225-228, https://doi.org/10.1002/ffj.1291 . [all data]

Mallavarapu, Kulkarni, et al., 2004
Mallavarapu, G.R.; Kulkarni, R.N.; Baskaran, K.; Ramesh, S., The essential oil composition of anise hyssop grown in India, Flavour Fragr. J., 2004, 19, 4, 351-353, https://doi.org/10.1002/ffj.1316 . [all data]

Mehrabani, Asadipour, et al., 2004
Mehrabani, M.; Asadipour, A.; Amoli, S.S., Chemical constituents of the essential oil of NEPETA DEPAUPERATA BENTH. from Iran, DARu: Journal of Faculty of Pharmacy, 2004, 12, 98-100. [all data]

Orav, Stulova, et al., 2004
Orav, A.; Stulova, I.; Kailas, T.; Müürisepp, M., Effect of storage on the essential oil composition of piper nigrum L. fruits of different ripening states, J. Agric. Food Chem., 2004, 52, 9, 2582-2586, https://doi.org/10.1021/jf030635s . [all data]

Palá-Paúl, Velasco-Negueruela, et al., 2004
Palá-Paúl, J.; Velasco-Negueruela, A.; Pérez-Alonso, M.J.; Maqueda, J.; Sanz, J., Volatile oil constituents from different parts of Cachrys trifida L., J. Essent. Oil Res., 2004, 16, 4, 347-349, https://doi.org/10.1080/10412905.2004.9698738 . [all data]

Raal, Paaver, et al., 2004
Raal, A.; Paaver, U.; Arak, E.; Orav, A., Content and composition of the essential oil of Thymus serpyllum L. growing wild in Estonia, Medicina (Kaunas), 2004, 40, 8, 795-800. [all data]

Rohloff, Mordal, et al., 2004
Rohloff, J.; Mordal, R.; Dragland, S., Chemotypical variation of tansy (Tanacetum vulgare L.) from 40 different locations in Norway, J. Agric. Food Chem., 2004, 52, 6, 1742-1748, https://doi.org/10.1021/jf0352430 . [all data]

Rojas, Usubillaga, et al., 2004
Rojas, L.B.; Usubillaga, A.; Cegarra, J.A.; Borregales, E.; Carrero, Y., Composición Química y actividad antimicótica de el aceite Esenchial ede la Lepechinia schiedeane (Schlecht) vatke, Rev. Fac. Farm., 2004, 46, 1, 27-30. [all data]

Royas, Usubillaga, et al., 2004
Royas, L.B.; Usubillaga, A.; Cegarra, J.A.; Borreagales, E.; Carrero, S., Composicion Quimica y Actividad Antimicotica de el Aceite Esensial de la Lepechinia schiedeana (Schlecht) Vatke, Revista de la Facultad de Farmacia, 2004, 46, 1, 27-30. [all data]

Couladis, Özcan, et al., 2003
Couladis, M.; Özcan, M.; Tzakou, O.; Akgül, A., Comparative essential oil composition of various parts of the turpentine tree (Pistacia terebinthus L) growing wild in Turkey, J. Sci. Food Agric., 2003, 83, 2, 136-138, https://doi.org/10.1002/jsfa.1295 . [all data]

Dudai, Larkov, et al., 2003
Dudai, N.; Larkov, O.; Chaimovitsh, D.; Lewinsohn, E.; Freiman, L.; Ravid, U., Essential oil compounds of Origanum dayi Post, Flavour Fragr. J., 2003, 18, 4, 334-337, https://doi.org/10.1002/ffj.1237 . [all data]

Feizbaksh, Saber Tehrani, et al., 2003
Feizbaksh, A.; Saber Tehrani, M.; Rustaiyan, A.; Masoudi, S., Composition of the essential oil of Stachys lavandulifolia Vahl. from Iran, J. Essent. Oil Res., 2003, 15, 2, 72-73, https://doi.org/10.1080/10412905.2003.9712068 . [all data]

Fekam Boyom, Amvam Zollo, et al., 2003
Fekam Boyom, F.; Amvam Zollo, P.H.; Agnaniet, H.; Menut, C.; Bessière, J.M., Aromatic plants of tropical central Africa. Part XLIII volatiles components from Uvariastrum pierreanum Engl. (Engl. Diels) growing in Cameroon, Flavour Fragr. J., 2003, 18, 4, 296-298, https://doi.org/10.1002/ffj.1218 . [all data]

Fekam Boyom, Ngouana, et al., 2003
Fekam Boyom, F.; Ngouana, V.; Amvam Zollo, P.H.; Menut, C.; Bessiere, J.M.; Gut, J.; Rosenthal, P.J., Composition and anti-plasmodial activities of essential oils from some Cameroonian medicinal plants, Phytochemistry, 2003, 64, 7, 1269-1275, https://doi.org/10.1016/j.phytochem.2003.08.004 . [all data]

Ghannadi, Aghazari, et al., 2003
Ghannadi, A.; Aghazari, F.; Mehrabani, M.; Mohagheghzadeh, A.; Mehregan, I., Quantity and composition of the SDE prepared essential oil of Nepeta macrosiphon Boiss, Iran. J. Pharm. Res., 2003, 2, 103-105. [all data]

Jayaprakasha, Rao, et al., 2003
Jayaprakasha, G.K.; Rao, L.J.M.; Sakariah, K.K., Volatile constituents from Cinnamomum zeylanicum fruit stalks and their antioxidant activities, J. Agric. Food Chem., 2003, 51, 15, 4344-4348, https://doi.org/10.1021/jf034169i . [all data]

Jirovetz, Buchbauer, et al., 2003
Jirovetz, L.; Buchbauer, G.; Shafi, M.P.; Kaniampady, M.M., Chemotaxonomical analysis of the essential oil aroma compounds of four different Ocimumspecies from southern India, Eur. Food Res. Technol., 2003, 217, 2, 120-124, https://doi.org/10.1007/s00217-003-0708-1 . [all data]

Jirovetz, Buchbauer, et al., 2003, 2
Jirovetz, L.; Buchbauer, G.; Shafi, M.P.; Leela, N.K., Analysis of the essential oils of the leaves, stems, rhizomes and roots of the medicinal plant Alpinia galanga from southern India, Acta Pharm. Hung., 2003, 53, 73-81. [all data]

Limberger, Simões-Pires, et al., 2003
Limberger, R.P.; Simões-Pires, C.A.; Sobral, M.; Menut, C.; Bessiere, J.-M.; Henriques, A.T., Essential oils of six Gomidesia spp. from southern Brazil, Flavour Fragr. J., 2003, 18, 2, 144-147, https://doi.org/10.1002/ffj.1122 . [all data]

Marongiu, Porcedda, et al., 2003
Marongiu, B.; Porcedda, S.; Caredda, A.; de Gioannis, B.; Vargiu, L.; la Colla, P., Extraction of Juniperus oxycedrus ssp. Oxycedrus essential oil by supercritical carbon dioxide: influence of some process parameters and biological activity, Flavour Fragr. J., 2003, 18, 5, 390-397, https://doi.org/10.1002/ffj.1224 . [all data]

Pino, Marbot, et al., 2003
Pino, J.A.; Marbot, R.; Fuentes, V., Characterization of volatiles in Bullock's heart (Annona reticulata L.) fruit cultivars from Cuba, J. Agric. Food Chem., 2003, 51, 13, 3836-3839, https://doi.org/10.1021/jf020733y . [all data]

Pitarokili, Tzakou, et al., 2003
Pitarokili, D.; Tzakou, O.; Loukis, A.; Harvala, C., Volatile metabolites from Salvia fruticosa as antifungal agents in soilborne pathogens, J. Agric. Food Chem., 2003, 51, 11, 3294-3301, https://doi.org/10.1021/jf0211534 . [all data]

Sajjadi and Mehregan, 2003
Sajjadi, S.E.; Mehregan, I., Chemical composition of the essential oil of Prangos Asperula Boiss. subsp. haussknechtii (Boiss.) Hernst. et Heyn fruits, 2003, retrieved from http://www1.tums.ac.ir/daru/daru2%2020003/Dr%20Sajadi.PDF. [all data]

Sajjadi and Mehregan, 2003, 2
Sajjadi, S.E.; Mehregan, I., Composition of the essential oil of Stachys Iaxa Boiss. Buhse, Iran. J. Pharm. Res., 2003, 57-58. [all data]

Senatore and Bruno, 2003
Senatore, F.; Bruno, M., Composition of the essential oil of Pallenis spinosa (L.) Cass. (Asteraceae), Flavour Fragr. J., 2003, 18, 3, 195-197, https://doi.org/10.1002/ffj.1180 . [all data]

Shahmir, Ahmadi, et al., 2003
Shahmir, F.; Ahmadi, L.; Mirza, M.; Korori, S.A.A., Secretory elements of needles and berries of Juniperus communis L. ssp. communis and its volatile constituents, Flavour Fragr. J., 2003, 18, 5, 425-428, https://doi.org/10.1002/ffj.1243 . [all data]

da Silva, Luz, et al., 2003
da Silva, J.D.; Luz, A.I.R.; da Silva, M.H.L.; Andrade, E.H.A.; Soghbi, M.G.B.; Maia, J.G.S., Essential oils of the leaves and stems of four Psidium spp., Flavour Fragr. J., 2003, 18, 3, 240-243, https://doi.org/10.1002/ffj.1219 . [all data]

Stashenko, Jaramillo, et al., 2003
Stashenko, E.E.; Jaramillo, B.E.; Martínez, J.R., Comparación de la composición química y de la actividad antioxidante in vitro de los metabolitos secundarios volátiles de plantas de la familia verbenaceae, Rev. Acad. Colomb. Cienc. Exactas Fis. Nat., 2003, 27, 105, 579-597. [all data]

Zoghbi, Andrade, et al., 2003
Zoghbi, M.G.B.; Andrade, E.H.A.; da Silva, M.H.; Carreira, L.M.M.; Maia, J.G.S., Essential oils from three Myrcia species, Flavour Fragr. J., 2003, 18, 5, 421-424, https://doi.org/10.1002/ffj.1242 . [all data]

Ahmadi, Mirza, et al., 2002
Ahmadi, L.; Mirza, M.; Shahmir, F., The volatile constituents of Artemisia marschaliana Sprengel and its secretory elements, Flavour Fragr. J., 2002, 17, 2, 141-143, https://doi.org/10.1002/ffj.1055 . [all data]

Boyom, Keumedjio, et al., 2002
Boyom, F.F.; Keumedjio, F.; Dongmo, P.M.J.; Ngadjui, B.T.; Zollo, A.; Menut, C.; Bessiere, J.M., Essential oils from Croton zambesicus Muell. Arg. growing in Cameroon, Flavour Fragr. J., 2002, 17, 3, 215-217, https://doi.org/10.1002/ffj.1081 . [all data]

Cavaleiro, Salgueiro, et al., 2002
Cavaleiro, C.; Salgueiro, L.; Barroso, J.G.; Figueiredo, A.C.; Pedro, L.G.; Fontinha, S.S.; Bighelli, A.; Casanova, J.; Looman, A.; Scheffer, J.J.C., Composition of the essential oil of Juniperus cedrus Webb and Berth. grown on Madeira, Flavour Fragr. J., 2002, 17, 2, 111-114, https://doi.org/10.1002/ffj.1061 . [all data]

Cicció and Gómez-Laurito, 2002
Cicció, J.F.; Gómez-Laurito, J., Volatile constituents of the leaves of Siparuna thecaphora (Siparunaceae) from Turrialba, Costa Rica, Rev. Biol. Trop., 2002, 50, 3/4, 963-967. [all data]

Flamini, Ertugrul, et al., 2002
Flamini, G.; Ertugrul, K.; Cioni, P.L.; Morelli, I.; Dural, H.; Bagci, Y., Volatile constituents of two endemic Centaurea species from Turkey: C. pseudoscabiosa subsp. pseudoscabiosa and C. hadimensis, Biochem. Syst. Ecol., 2002, 30, 10, 953-959, https://doi.org/10.1016/S0305-1978(02)00043-1 . [all data]

Gudzic, Djokovic, et al., 2002
Gudzic, B.; Djokovic, D.; Vajs, V.; Palic, R.; Stojanovic, G., Composition and antimicrobial activity of the essential oil of Hypericum maculatum Crantz, Flavour Fragr. J., 2002, 17, 5, 392-394, https://doi.org/10.1002/ffj.1112 . [all data]

Iñigo, Palá-Paúl, et al., 2002
Iñigo, A.; Palá-Paúl, J.; Pérez-Alonso, M.J.; Velasco-Negueruela, A., Essential oil composition from the aerial parts of Haplophyllum linifolium (L.) G. Don fil., Botanica Complutensis, 2002, 26, 79-83. [all data]

Jirovetz, Buchbauer, et al., 2002
Jirovetz, L.; Buchbauer, G.; Ngassoum, M.B.; Geissler, M., Aroma compound analysis of Piper nigrum and Piper guineense essential oils from Cameroon using solid-phase microextraction-gas chromatography, solid-phase microextraction-gas chromatography-mass spectrometry and olfactometry, J. Chromatogr. A, 2002, 976, 1-2, 265-275, https://doi.org/10.1016/S0021-9673(02)00376-X . [all data]

Juteau, Masotti, et al., 2002
Juteau, F.; Masotti, V.; Bessière, J.-M., Compositional characteristics of the essential oil of Artemisia campestris var. glutinosa, Biochem. Syst. Ecol., 2002, 30, 11, 1065-1070, https://doi.org/10.1016/S0305-1978(02)00052-2 . [all data]

Kabouss, Charrouf, et al., 2002
Kabouss, A.E.; Charrouf, Z.; Faid, M.; Garneau, F.-X.; Collin, G., Chemical composition and antimicrobial activity of the leaf essential oil of Argania spinosa L. Skeels, J. Essent. Oil Res., 2002, 14, 2, 147-149, https://doi.org/10.1080/10412905.2002.9699801 . [all data]

Khallouki, Younos, et al., 2002
Khallouki, F.; Younos, C.; Soulimani, R.; Bessière, J.M., Chemical composition of the essential oils of Annona cuneata L. and Annona senegalensis Pers. stem barks, Flavour Fragr. J., 2002, 17, 5, 398-400, https://doi.org/10.1002/ffj.1115 . [all data]

Kobaisy, Tellez, et al., 2002
Kobaisy, M.; Tellez, M.R.; Dayan, F.E.; Duke, S.O., Phytotoxicity and volatile constituents from leaves of Callicarpa japonica Thunb., Phytochemistry, 2002, 61, 1, 37-40, https://doi.org/10.1016/S0031-9422(02)00207-8 . [all data]

Krauze-Baranowska, Mardarowicz, et al., 2002
Krauze-Baranowska, M.; Mardarowicz, M.; Wiwart, M.; Poblocka, L.; Dynowska, M., Antifungal activity of the essential oils from some species of the genus Pinus, Z. Naturforsch., 2002, 57c, 478-482. [all data]

Krauze-Baranowska, Mardarowicz, et al., 2002, 2
Krauze-Baranowska, M.; Mardarowicz, M.; Wiwart, M., The chemical composition of Microbiota decussata, Z. Naturforsch. C:, 2002, 57c, 998-1003. [all data]

Kuiate, Bessière, et al., 2002
Kuiate, J.-R.; Bessière, J.-M.; Zollo, P.-H.A., Composition of the essential oils from three Laggera Spp. from Cameroon, Flavour Fragr. J., 2002, 17, 2, 105-108, https://doi.org/10.1002/ffj.1057 . [all data]

Limberger, Simões-Pires, et al., 2002
Limberger, R.P.; Simões-Pires, C.; Sobral, M.; Menu, C.; Bessiere, J.-M.; Henriques, A.T., Essential oils from some Myrceugenia species (Myrtaceae), Flavour Fragr. J., 2002, 17, 5, 341-344, https://doi.org/10.1002/ffj.1113 . [all data]

Lockwood, Asghari, et al., 2002
Lockwood, G.B.; Asghari, G.; Hakimi, B., Production of essential oil constituents by cultured cells of Carum copticum L., Flavour Fragr. J., 2002, 17, 6, 456-458, https://doi.org/10.1002/ffj.1129 . [all data]

Maia, da Silva, et al., 2002
Maia, J.G.S.; da Silva, M.H.L.; Andrade, E.H.A.; Zoghbi, M.G.B.; Carreira, L.M.M., Essential oils from Astronium urundeuva (Allemao) Engl. and A. fraxinifolium Schott ex Spreng., Flavour Fragr. J., 2002, 17, 1, 72-74, https://doi.org/10.1002/ffj.1046 . [all data]

Maia, Zoghbi, et al., 2002
Maia, J.G.S.; Zoghbi, M.G.B.; Andrade, E.H.A.; da Silva, M.H.L.; Luz, A.I.R.; da Silva, J.D., Essential oils composition of Eupatorium species growing wild in the Amazon, Biochem. Syst. Ecol., 2002, 30, 11, 1071-1077, https://doi.org/10.1016/S0305-1978(02)00059-5 . [all data]

Menut, Bessière, et al., 2002
Menut, C.; Bessière, J.M.; Hassani, M.S.; Buchbauer, G.; Schopper, B., Chemical and biological studies of Ocotea comoriensis bark essential oil, Flavour Fragr. J., 2002, 17, 6, 459-461, https://doi.org/10.1002/ffj.1130 . [all data]

Morteza-Semnani, Saeedi, et al., 2002
Morteza-Semnani, K.; Saeedi, M.; Vahedi, M., Volatile constituents of Iranian Hypericum perfloratum L., Oriental J. Chem., 2002, 18, 3, 443-444. [all data]

Norouzi-Arasi, Yavari, et al., 2002
Norouzi-Arasi, H.; Yavari, I.; Ghaffarzadeh, F.; Mortazavi, M.-S., Volatile constituents of Cymbopogon olivieri (Boiss.) Bor from Iran, Flavour Fragr. J., 2002, 17, 4, 272-274, https://doi.org/10.1002/ffj.1096 . [all data]

Pino, Marbot, et al., 2002
Pino, J.A.; Marbot, R.; Vazquez, C., Characterization of volatiles in Loquat fruit (Eriobotrya japonica Lindl.), Revista CENIC Ciencias Quimicas, 2002, 33, 3, 115-119. [all data]

Schwob, Bessière, et al., 2002
Schwob, I.; Bessière, J.-M.; Viano, J., Composition of the essential oils of Hypericum perforatum L. from southeastern France, C.R. Acad. Sci. Ser. 3:, 2002, 325, 781-785. [all data]

Sefidkon, Dabiri, et al., 2002
Sefidkon, F.; Dabiri, M.; Alamshahi, A., Analysis of the essential oil of Nepeta fissa C.A. Mey from Iran, Flavour Fragr. J., 2002, 17, 2, 89-90, https://doi.org/10.1002/ffj.1045 . [all data]

Velasco-Negueruela, Pérez-Alonso, et al., 2002
Velasco-Negueruela, A.; Pérez-Alonso, M.J.; Palá-Paúl, J.; Íñigo, A.; López, G., Leaf essential oils analysis of Juniperus navicularis Gandoger, Botanica Complutensis, 2002, 26, 85-91. [all data]

Zoghbi, Andrade, et al., 2002
Zoghbi, M.G.B.; Andrade, E.H.A.; da Silva, M.H.L.; Maia, J.G.S., Volatile constituents of Lippia lupulina Cham., Flavour Fragr. J., 2002, 17, 1, 29-31, https://doi.org/10.1002/ffj.1032 . [all data]

Zoghbi, Andrade, et al., 2002, 2
Zoghbi, M.G.B.; Andrade, E.H.A.; da Silva, M.H.; Maia, J.G.S.; Luz, A.I.R.; da Silva, J.D., Chemical variation in the essential oils of Hyptis crenata Pohl ex Benth., Flavour Fragr. J., 2002, 17, 1, 5-8, https://doi.org/10.1002/ffj.1031 . [all data]

Cherchi, Deidda, et al., 2001
Cherchi, G.; Deidda, D.; de Gioannis, B.; Marongiu, B.; Pompei, R.; Porcedda, S., Extraction of Santolina insularis essential oil by supercritical carbon dioxide: influence of some process parameters and biological activity, Flavour Fragr. J., 2001, 16, 1, 35-43, https://doi.org/10.1002/1099-1026(200101/02)16:1<35::AID-FFJ942>3.0.CO;2-Y . [all data]

Jacquemond-Collet, Bessière, et al., 2001
Jacquemond-Collet, I.; Bessière, J.-M.; Hannedouche, S.; Bertrand, C.; Fourasté, I.; Moulis, C., Identification of the alkaloids of Galipea officinalis by gas chromatography-mass spectrometry, Phytochem. Anal., 2001, 12, 5, 312-319, https://doi.org/10.1002/pca.594 . [all data]

Kalemba, Marschall, et al., 2001
Kalemba, D.; Marschall, H.; Bradesi, P., Constituents of the essential oil of Solidago gigantea Ait. (giant goldenrod), Flavour Fragr. J., 2001, 16, 1, 19-26, https://doi.org/10.1002/1099-1026(200101/02)16:1<19::AID-FFJ940>3.0.CO;2-U . [all data]

Marongiu, Porcedda, et al., 2001
Marongiu, B.; Porcedda, S.; Porta, G.D.; Reverchon, E., Extraction and isolation of Salvia desoleana and Mentha spicata subsp. insularis essential oils by supercritical CO2, Flavour Fragr. J., 2001, 16, 5, 384-388, https://doi.org/10.1002/ffj.1021 . [all data]

Palmeira, Conserva, et al., 2001
Palmeira, S.F., Jr.; Conserva, L.M.; Andrade, E.H.A.; Guilhon, G.M.S.P., Analysis by GC-MS of the hexane extract of the aerial parts of Aristolochia acutifolia Duchtr., Flavour Fragr. J., 2001, 16, 2, 85-88, https://doi.org/10.1002/1099-1026(200103/04)16:2<85::AID-FFJ948>3.0.CO;2-2 . [all data]

Palá-Paúl, Pérez-Alonso, et al., 2001
Palá-Paúl, J.; Pérez-Alonso, M.J.; Velasco-Negueruela, A.; Palá-Paúl, R.; Sanz, J.; Conejero, Fco., Seasonal variation in chemical constituents of Santolina rosmarinifolia L. ssp. rosmarinifolia, Biochem. Syst. Ecol., 2001, 29, 7, 663-672, https://doi.org/10.1016/S0305-1978(01)00032-1 . [all data]

Santos, Moreira, et al., 2001
Santos, P.R.; Moreira, D.L.; Guimaraes, E.F.; Kaplan, M.A.C., Essential oil analysis of 10 piperaceae species from the Brazilian Atlantic forest, Phytochemistry, 2001, 58, 4, 547-551, https://doi.org/10.1016/S0031-9422(01)00290-4 . [all data]

Bailac, Dellacasa, et al., 2000
Bailac, P.N.; Dellacasa, A.D.; Bernasconi, H.O.; Firpo, N.H.; Ponzi, M.I., Composicion del aceite esencial y actividad antimicrobiana de eupatorium patens, Bol. Soc. Chil. Quim., 2000, 45, 207-211. [all data]

Bicalho, Pereira, et al., 2000
Bicalho, B.; Pereira, A.S.; Aquino Neto, F.R.; Pinto, A.C.; Rezende, C.M., Application of high-temperature gas chromatography-mass spectrometry to the investigation of glycosidically bound components related to cashew applie (Anacardium occidentale L. Var. nanum) volatiles, J. Agric. Food Chem., 2000, 48, 4, 1167-1174, https://doi.org/10.1021/jf9909252 . [all data]

Novak, Novak, et al., 2000
Novak, J.; Novak, S.; Bitsch, C.; Franz, C.M., Essential oil composition of underground parts of Valeriana celtica ssp. from Austria and Italy, Flavour Fragr. J., 2000, 15, 1, 40-42, https://doi.org/10.1002/(SICI)1099-1026(200001/02)15:1<40::AID-FFJ863>3.0.CO;2-B . [all data]

Tellez, Dayan, et al., 2000
Tellez, M.R.; Dayan, F.E.; Schrader, K.K.; Wedge, D.E.; Duke, S.O., Composition and some biological activities of the essential oils of Callicarpa Americana (L.), J. Agric. Food Chem., 2000, 48, 7, 3008-3012, https://doi.org/10.1021/jf991026g . [all data]

Ayedoun, Adéoti, et al., 1999
Ayedoun, M.A.; Adéoti, B.S.; Setondji, J.; Tchoumbougnang, F.; Kuiaté, J.R.; Zollo, P.H.A.; Menut, C.; Lamaty, G.; Bessière, J.M., Aromatic plants of tropical West Africa. XII. Essential oil of Hoslundia opposita Vahl. growing in Benin and Cameroon, Flavour Fragr. J., 1999, 14, 5, 319-321, https://doi.org/10.1002/(SICI)1099-1026(199909/10)14:5<319::AID-FFJ836>3.0.CO;2-O . [all data]

Kalemba, 1999
Kalemba, D., Constituents of the essential oil of Artemisia asiatica Nakai, Flavour Fragr. J., 1999, 14, 3, 173-176, https://doi.org/10.1002/(SICI)1099-1026(199905/06)14:3<173::AID-FFJ805>3.0.CO;2-Q . [all data]

Kuiate, Zollo, et al., 1999
Kuiate, J.-R.; Zollo, P.-H.A.; Nguefa, E.H.; Bessière, J.-M.; Lamaty, G.; Menut, C., Composition of the essential oils from the leaves of Microglossa pyrifolia (Lam.) O. Kuntze and Helichrysum odoratissimum (L.) Less. growing in Cameroon, Flavour Fragr. J., 1999, 14, 2, 82-84, https://doi.org/10.1002/(SICI)1099-1026(199903/04)14:2<82::AID-FFJ780>3.0.CO;2-Z . [all data]

Menon, Chacko, et al., 1999
Menon, A.N.; Chacko, S.; Narayanan, C.S., Free and glycosidically bound volatiles of cardamom (Eletteria cardamomum Maton var. miniscula Burkill), Flavour Fragr. J., 1999, 14, 1, 65-68, https://doi.org/10.1002/(SICI)1099-1026(199901/02)14:1<65::AID-FFJ789>3.0.CO;2-A . [all data]

Rustaiyan, Masoudi, et al., 1999
Rustaiyan, A.; Masoudi, S.; Monfared, A.; Komeilizadeh, H., Volatile constituents of three Salvia species grown wild in Iran, Flavour Fragr. J., 1999, 14, 5, 276-278, https://doi.org/10.1002/(SICI)1099-1026(199909/10)14:5<276::AID-FFJ825>3.0.CO;2-Y . [all data]

Tellez, Canel, et al., 1999
Tellez, M.R.; Canel, C.; Rimando, A.M.; Duke, S.O., Differential accumulation of isoprenoids in glanded and glandless Artemisia annua L, Phytochemistry, 1999, 52, 6, 1035-1040, https://doi.org/10.1016/S0031-9422(99)00308-8 . [all data]

Zoghbi, Andrade, et al., 1999
Zoghbi, M.G.B.; Andrade, E.H.A.; Maia, J.G.S., The essential oil of Vitex angus-castus L. growing in the Amazon region, Flavour Fragr. J., 1999, 14, 4, 211-213, https://doi.org/10.1002/(SICI)1099-1026(199907/08)14:4<211::AID-FFJ812>3.0.CO;2-W . [all data]

El-Sakhawy, El-Tantawy, et al., 1998
El-Sakhawy, F.S.; El-Tantawy, M.E.; Ross, S.A.; El-Sohly, M.A., Composition and antimicrobial activity of the essential oil of Murraya exotica L., Flavour Fragr. J., 1998, 13, 1, 59-62, https://doi.org/10.1002/(SICI)1099-1026(199801/02)13:1<59::AID-FFJ693>3.0.CO;2-L . [all data]

Kökdil, Kurucu, et al., 1998
Kökdil, G.; Kurucu, S.; Yildiz, A., Essential oil composition of Nepeta nuda L. ssp. nuda, Flavour Fragr. J., 1998, 13, 4, 233-234, https://doi.org/10.1002/(SICI)1099-1026(1998070)13:4<233::AID-FFJ730>3.0.CO;2-7 . [all data]

Maia, Zohhbi, et al., 1998
Maia, J.G.S.; Zohhbi, M.G.B.; Andrade, E.H.A.; Santos, A.S.; da Silva, M.H.L.; Luz, A.I.R.; Bastos, C.N., Constituents of the essential oil of Piper aduncum L. growing wild in the Amazon region, Flavour Fragr. J., 1998, 13, 4, 269-272, https://doi.org/10.1002/(SICI)1099-1026(1998070)13:4<269::AID-FFJ744>3.0.CO;2-A . [all data]

Santos, Andrade, et al., 1998
Santos, A.S.; Andrade, E.H.A.; Zoghbi, M. das.G.B.; Luz, A.I.R.; Maia, J.G.S., Sesquiterpenes of Amazonian Piper species, Acta Amazomica, 1998, 28, 2, 127-130. [all data]

Stashenko, Cervantes, et al., 1998
Stashenko, E.E.; Cervantes, M.; Combariza, Y.; Martínez, J.R., HRGC-FID-MSD Analysis of the Secondary Metabolites Obtained by Different Extraction Methods from Lepechinia schiedeana, and Evaluation of its Antioxidant Activity in vitro in 20th International Symposium on Capillary Chromatography, 1998, 1-11. [all data]

Zollo, Biyiti, et al., 1998
Zollo, P.H.A.; Biyiti, L.; Tchoumbougnang, F.; Menut, C.; Lamaty, G.; Bouchet, Ph., Aromatic plants of tropical central Africa. Part XXXII. Chemical composition and antifungal activity of thirteen essential oils from aromatic plants of Cameroon, Flavour Fragr. J., 1998, 13, 2, 107-114, https://doi.org/10.1002/(SICI)1099-1026(199803/04)13:2<107::AID-FFJ701>3.0.CO;2-G . [all data]

Salgueiro, Vila, et al., 1997
Salgueiro, L.R.; Vila, R.; Tomi, F.; Figueiredo, A.C.; Barroso, J.G.; Cañigueral, S.; Casanova, J.; da Cunha, A.P.; Adzet, T., Variability of essential oils of Thymus caespititius from Portugal, Phytochemistry, 1997, 45, 2, 307-311, https://doi.org/10.1016/S0031-9422(96)00872-2 . [all data]

Zunino, Novillo-Newton, et al., 1997
Zunino, M.P.; Novillo-Newton, M.; Maestri, D.M.; Zygadlo, J.A., Composition of the essential oil of Baccharis crispa Spreng. and Baccharis salicifolia Pers. grown in Cordoba (Argentina), Flavour Fragr. J., 1997, 12, 6, 405-407, https://doi.org/10.1002/(SICI)1099-1026(199711/12)12:6<405::AID-FFJ667>3.0.CO;2-R . [all data]

Zygadlo, Ariza-Espinar, et al., 1997
Zygadlo, J.A.; Ariza-Espinar, L.; Velasco-Negueruela, A.; Perez-Alonso, M.J., Volatile constituents of Stevia achalensis hieronymus, Flavour Fragr. J., 1997, 12, 4, 297-299, https://doi.org/10.1002/(SICI)1099-1026(199707)12:4<297::AID-FFJ625>3.0.CO;2-2 . [all data]

Orav, Kailas, et al., 1996
Orav, A.; Kailas, T.; Liiv, M., Analysis of terpenoic composition of conifer needle oils by steam distillation/extraction, gas chromatography and gas chromatography-mass spectrometry, Chromatographia, 1996, 43, 3/4, 215-219, https://doi.org/10.1007/BF02292955 . [all data]

Rajeswara, Kaul, et al., 1996
Rajeswara, B.R.; Kaul, P.N.; Bhattacharya, A.K.; Mallavarapu, G.R.; Ramesh, S., Yield and chemical composition of the essential oils of three Cymbopogon species suffering from iron chlorosis, Flavour Fragr. J., 1996, 11, 5, 289-293, https://doi.org/10.1002/(SICI)1099-1026(199609)11:5<289::AID-FFJ590>3.0.CO;2-7 . [all data]

Thanh, Dung, et al., 1996
Thanh, L.; Dung, N.X.; Bighetti, A.; Casanova, J.; Leclercq, P.A., Combination of cCapillary GC, GC/MS and 13C-NMR for the Characterization of the Rhizome Oil of Piper betle L. (Piperaceae) from Vietnam, Spectroscopy, 1996, 13, 2, 131-136, https://doi.org/10.1155/1997/397354 . [all data]

Gopalakrishnan, Menon, et al., 1993
Gopalakrishnan, M.; Menon, N.; Padmakumari, K.P.; Jayalekshmy, A.; Narayanan, C.S., GC Analysis and Odor Profiles of Four New Indian Genotypes of Piper nigrum L., J. Essent. Oil Res., 1993, 5, 3, 247-253, https://doi.org/10.1080/10412905.1993.9698217 . [all data]

Jantan and Goh, 1990
Jantan, I.; Goh, S.H., The essential oils of Cinnamomum mollissimum as natural sources of safrole and benzyl benzoate, J. Tropical Forest Sci., 1990, 2, 3, 252-259. [all data]