Benzofuroxan

Gas phase thermochemistry data

Data compiled by: Hussein Y. Afeefy, Joel F. Liebman, and Stephen E. Stein

Quantity Value Units Method Reference Comment
Δfgas298.5 ± 2.2kJ/molCcbLeitao, Pilcher, et al., 1990

Condensed phase thermochemistry data

Data compiled by: Hussein Y. Afeefy, Joel F. Liebman, and Stephen E. Stein

Quantity Value Units Method Reference Comment
Δfsolid218.9 ± 1.4kJ/molCcbLeitao, Pilcher, et al., 1990
Quantity Value Units Method Reference Comment
Δcsolid-3151.6 ± 1.2kJ/molCcbLeitao, Pilcher, et al., 1990

Phase change data

Data compiled as indicated in comments:
ALS - Hussein Y. Afeefy, Joel F. Liebman, and Stephen E. Stein
AC - William E. Acree, Jr., James S. Chickos

Quantity Value Units Method Reference Comment
Δsub79.6 ± 1.7kJ/molCLeitao, Pilcher, et al., 1990ALS
Δsub79.6 ± 1.7kJ/molCLeitao, Pilcher, et al., 1990AC

References

Leitao, Pilcher, et al., 1990
Leitao, M.L.; Pilcher, G.; Acree, W.E., Jr.; Zvaigzne, A.I.; Tucker, S.A.; Ribeiro Da Silva, M.D.M.C., Enthalpies of combustion of phenazine N-oxide, phenazine, benzofuroxan, and benzofurazan: the dissociation entrhalpies of the (N-O) bonds, J. Chem. Thermodyn., 1990, 22, 923-928. [all data]

Smith and Brown, 1951
Smith, P.A.; Brown, B.B., J. Am. Chem. Soc., 1951, 73, 2435. [all data]