Butanoic acid, 2,3-dihydroxy-2-(1-methylethyl)-, (2,3,5,7a-tetrahydro-1-hydroxy-1H-pyrrolizin-7-yl)methyl ester, [1S-[1α,7(2R*,3R*),7aα]]-

Kovats' RI, non-polar column, temperature ramp

View large format table.

Column type Active phase I Reference Comment
CapillaryOV-12170.El-Shazly, El-Domiaty, et al., 1998He, 6. K/min; Column length: 30. m; Tstart: 150. C; Tend: 300. C
CapillaryDB-12175.El-Shazly, Sarg, et al., 1996He, 170. C @ 5. min, 10. K/min, 300. C @ 15. min; Column length: 30. m; Column diameter: 0.317 mm
CapillaryDB-12172.El-Shazly, Sarg, et al., 1996, 2He, 170. C @ 5. min, 10. K/min, 300. C @ 15. min; Column length: 30. m

Van Den Dool and Kratz RI, non-polar column, temperature ramp

View large format table.

Column type Active phase I Reference Comment
CapillaryDB-12172.Witte, Rubiolo, et al., 1992He, 6. K/min; Column length: 30. m; Column diameter: 0.32 mm; Tstart: 150. C; Tend: 300. C

References

El-Shazly, El-Domiaty, et al., 1998
El-Shazly, A.; El-Domiaty, M.; Witte, L.; Wink, M., Pyrrolizidine alkaloids in members of the boraginaceae from Sinai (Egypt), Biochem. Syst. Ecol., 1998, 26, 6, 619-636, https://doi.org/10.1016/S0305-1978(98)00028-3 . [all data]

El-Shazly, Sarg, et al., 1996
El-Shazly, A.; Sarg, T.; Witte, L.; Wink, M., Pyrrolizidine alkaloids from Cynoglossum creticum, Phytochemistry, 1996, 42, 4, 1217-1221, https://doi.org/10.1016/0031-9422(96)00112-4 . [all data]

El-Shazly, Sarg, et al., 1996, 2
El-Shazly, A.; Sarg, T.; Ateya, A.; Abdel Aziz, E.; Witte, L.; Wink, M., Pyrrolizidine alkaloids of cynoglossum officinale and Cynoglossum amabile (family boraginaceae), Biochem. Syst. Ecol., 1996, 24, 5, 415-421, https://doi.org/10.1016/0305-1978(96)00035-X . [all data]

Witte, Rubiolo, et al., 1992
Witte, L.; Rubiolo, P.; Bicchi, C.; Hartmann, T., Comparative analysis of pyrrolizidine alkaloids from natural sources by gas chromatography-mass spectrometry, Phytochemistry, 1992, 32, 1, 187-196, https://doi.org/10.1016/0031-9422(92)80130-7 . [all data]