Integerrimine

Normal alkane RI, non-polar column, temperature ramp

Data compiled by: NIST Mass Spectrometry Data Center, William E. Wallace, director

Column type CapillaryCapillaryCapillary
Active phase OV-1HP-5 MSOV-1
Column length (m) 30.30.30.
Carrier gas HeliumHeliumHe
Substrate
Column diameter (mm) 0.250.250.32
Phase thickness (μm) 0.250.250.25
Tstart (C) 100.100.70.
Tend (C) 300.280.300.
Heat rate (K/min) 6.5.6.
Initial hold (min)  2.3.
Final hold (min)  20.
I 2362.2402.2370.
ReferenceAsres, Sporer, et al., 2008Christov and Evstatieva, 2003Woldemichael and Wink, 2002
Comment MSDC-RI MSDC-RI MSDC-RI

References

Asres, Sporer, et al., 2008
Asres, K.; Sporer, F.; Wink, M., Occurence of pyrrolizidine alkaloids in three Ethiopian Solanecio species, Biochem. Systematics and Ecology, 2008, 36, 5-6, 399-407, https://doi.org/10.1016/j.bse.2007.10.003 . [all data]

Christov and Evstatieva, 2003
Christov, V.; Evstatieva, L., Alkaloid profile of Bulgarian species from genus Senecio L., Z. Naturforsch., 2003, 58c, 300-302. [all data]

Woldemichael and Wink, 2002
Woldemichael, G.M.; Wink, M., Concomitant occurrence of pyrrolizidine and quinolizidine alkaloids in hemiparasite Osyris alba L. (Santalaceae), Biochem. Syst. Ecol., 2002, 30, 2, 139-149, https://doi.org/10.1016/S0305-1978(01)00065-5 . [all data]