Jaconine

Kovats' RI, non-polar column, temperature ramp

Data compiled by: NIST Mass Spectrometry Data Center, William E. Wallace, director

Column type Capillary
Active phase OV-1
Column length (m) 30.
Carrier gas He
Substrate
Column diameter (mm) 0.25
Phase thickness (μm) 0.25
Tstart (C) 120.
Tend (C) 300.
Heat rate (K/min) 6.
Initial hold (min) 3.
Final hold (min) 10.
I 2548.
ReferenceEl-Shazly, 2002
Comment MSDC-RI

Van Den Dool and Kratz RI, non-polar column, temperature ramp

View large format table.

Column type Active phase I Reference Comment
CapillaryDB-12520.Witte, Rubiolo, et al., 1992He, 6. K/min; Column length: 30. m; Column diameter: 0.32 mm; Tstart: 150. C; Tend: 300. C
CapillaryOV-12527.Witte, Rubiolo, et al., 199225. m/0.25 mm/0.5 μm, H2, 6. K/min; Tstart: 150. C; Tend: 300. C
CapillaryDB-52573.Witte, Rubiolo, et al., 1992He, 6. K/min; Column length: 30. m; Column diameter: 0.32 mm; Tstart: 150. C; Tend: 300. C

Normal alkane RI, non-polar column, temperature ramp

View large format table.

Column type Active phase I Reference Comment
CapillaryOV-12584.Asres, Sporer, et al., 200830. m/0.25 mm/0.25 μm, Helium, 6. K/min; Tstart: 100. C; Tend: 300. C

References

El-Shazly, 2002
El-Shazly, A., Pyrrolizidine alkaloid profiles of some Senecio species from Egypt, Z. Naturforsch. C:, 2002, 57, 429-433. [all data]