r-1,c-2,t-3-trimethylcyclopropane

Phase change data

Data compiled by: Thermodynamics Research Center, NIST Boulder Laboratories, Chris Muzny director

Quantity Value Units Method Reference Comment
Tboil332.9KN/AKelso, Greenlee, et al., 1955Uncertainty assigned by TRC = 1. K

In addition to the Thermodynamics Research Center (TRC) data available from this site, much more physical and chemical property data is available from the following TRC products:

References

Kelso, Greenlee, et al., 1955
Kelso, R.G.; Greenlee, K.W.; Derfer, J.M.; Boord, C.E., The Synthesis, Purification and Properties of Some Polyalkylcyclo- propanes: Reduction of α,.gama.-Dibromides, J. Am. Chem. Soc., 1955, 77, 1751-5. [all data]