4-Methoxy-N-[[[(3-methoxyphenyl)methyl]amino]thioxomethyl]benzamide

Phase change data

Data compiled by: William E. Acree, Jr., James S. Chickos

Enthalpy of fusion

ΔfusH (kJ/mol) Temperature (K) Method Reference
31.02389.2DSCAbbott, Wohlman, et al., 2002

References

Abbott, Wohlman, et al., 2002
Abbott, Thomas P.; Wohlman, Alan; Isbell, Terry; Momany, Frank A.; Cantrell, Charles; Garlotta, Donald V.; Weisleder, David, 1,3-di(3-Methoxybenzyl) thiourea and related lipid antioxidants, Industrial Crops and Products, 2002, 16, 1, 43-57, https://doi.org/10.1016/S0926-6690(02)00006-7 . [all data]