trans-1,4-Di-tert-butyl-cyclohexane

Condensed phase thermochemistry data

Data compiled by: Hussein Y. Afeefy, Joel F. Liebman, and Stephen E. Stein

Quantity Value Units Method Reference Comment
Δcsolid-2177.1 ± 0.24kcal/molCcbVan Bekkum, Hoefnagel, et al., 1968Hfusion=4.1±0.2; Corresponding Δfsolid = -96.06 kcal/mol (simple calculation by NIST; no Washburn corrections)

References

Van Bekkum, Hoefnagel, et al., 1968
Van Bekkum, H.; Hoefnagel, M.A.; De Lavieter, L.; Van Veen, A.; Verkade, P.E.; Wemmers, A.; Wepster, B.M.; Palm, J.H.; Schafer, L.; Dekker, H.; Mosselman, C.; Somsen, G., Studies on cyclohexane derivatives. Part VI. cis- and trans-1,4-di-t-butylcyclohexane. Preparation and properties, Recueil, 1968, 87, 1363-1371. [all data]