cis-1,4-Di-tert-butyl-cyclohexane

Condensed phase thermochemistry data

Data compiled by: Hussein Y. Afeefy, Joel F. Liebman, and Stephen E. Stein

Quantity Value Units Method Reference Comment
Δcliquid-9145.4 ± 1.1kJ/molCcbVan Bekkum, Hoefnagel, et al., 1968Hfusion=2.1±0.2; Corresponding Δfliquid = -365.4 kJ/mol (simple calculation by NIST; no Washburn corrections)

Phase change data

Data compiled by: William E. Acree, Jr., James S. Chickos

Enthalpy of fusion

ΔfusH (kJ/mol) Temperature (K) Reference
8.79293.2van Bekkum, Hoefnagel, et al., 2010

References

Van Bekkum, Hoefnagel, et al., 1968
Van Bekkum, H.; Hoefnagel, M.A.; De Lavieter, L.; Van Veen, A.; Verkade, P.E.; Wemmers, A.; Wepster, B.M.; Palm, J.H.; Schafer, L.; Dekker, H.; Mosselman, C.; Somsen, G., Studies on cyclohexane derivatives. Part VI. cis- and trans-1,4-di-t-butylcyclohexane. Preparation and properties, Recueil, 1968, 87, 1363-1371. [all data]

van Bekkum, Hoefnagel, et al., 2010
van Bekkum, H.; Hoefnagel, M.A.; de Lavieter, L.; van Veen, A.; Verkade, P.E.; Wemmers, A.; Wepster, B.M.; Palm, J.H.; Schäfer, L.; Dekker, H.; Mosselman, C.; Somsen, G., Studies on cyclohexane derivatives. Part VI: cis- and trans-1,4-Di-t-butylcyclohexane. Preparation and properties, Recl. Trav. Chim. Pays-Bas, 2010, 86, 12, 1363-1371, https://doi.org/10.1002/recl.19670861213 . [all data]