1,3-Cyclopentadiene, 1,2-dimethyl-

Gas phase ion energetics data

Data compiled by: Henry M. Rosenstock, Keith Draxl, Bruce W. Steiner, and John T. Herron

Ionization energy determinations

IE (eV) Method Reference
8.1 ± 0.1EIMeyer and Harrison, 1964

Appearance energy determinations

Ion AE (eV) Other Products MethodReferenceComment
C6H7+10.7CH3EIHarrison, Haynes, et al., 1965
C7H9+11.05HEIHarrison, Haynes, et al., 1965

References

Meyer and Harrison, 1964
Meyer, F.; Harrison, A.G., Ionization potentials of methyl-substituted benzenes and cyclopentadienes, Can. J. Chem., 1964, 42, 2256. [all data]

Harrison, Haynes, et al., 1965
Harrison, A.G.; Haynes, P.; McLean, S.; Meyer, F., The mass spectra of methyl-substituted cyclopentadienes, J. Am. Chem. Soc., 1965, 87, 5099. [all data]